{"text_format":"1","workbook":"xlsx","n_sheets":4,"sheets":["Предложение","MPx_Add","Наименования","Прайс"],"not_rendered":{"charts":0,"images":1,"macros":1,"external_links":0,"defined_names":3,"comments":0,"pivot_tables":0},"unopened":[],"bounds":{"document_bytes":16777216,"sheet_cells":100000,"rows_first":2000,"rows_last":500,"rows_between":2000,"halvings":0,"cell_chars":16384,"cell_head_chars":4096},"cells_cut":0,"cells_raw":0,"read":"whole","date_system":"1900"}

{"sheet":"Предложение","index":0,"n_rows":216,"n_cols":7,"rows_kept":216,"cut":false,"hidden":false,"merged":[[10,2,10,6],[10,0,10,1],[7,0,7,1],[7,2,7,6],[3,0,3,1],[5,0,5,1],[3,2,3,6],[5,2,5,6],[8,2,8,6],[9,2,9,6]]}
[{"$f":"CONCATENATE(\"КОММЕРЧЕСКОЕ ПРЕДЛОЖЕНИЕ от \",TEXT(TODAY(),\"ДД.ММ.ГГ\"))","v":"КОММЕРЧЕСКОЕ ПРЕДЛОЖЕНИЕ от 22.07.24"}]
[{"$f":"CONCATENATE(\"Срок действия: \",TEXT(TODAY()+30,\"ДД.ММ.ГГ\"))","v":"Срок действия: 21.08.24"}]
[]
["От:",null,"ООО «СпецТехСнаб»,  Иванов И.И., ivan.ivanov@provento.ru, +7-999-888-77-66"]
[]
["Кому:",null,"ООО «Газпром трансгаз Ухта», Петров П.П., p.petrov@gazprom.ru, +7-888-777-66-55"]
[]
["Условия оплаты:",null,"Предоплата в размере 30% от суммы КП, окончательный расчет в течении 60 дней после подписания Покупателем Товарной накладной."]
[null,"Срок поставки:","2 недели с момента поступления предоплаты на р/сч Поставщика"]
[null,"Базис поставки:","DDP 169300, РФ, Республика Коми, г. Ухта, набережная Газовиков 10/1"]
["Примечания:",null,"Стоимость предлагаемой продукции указана с учетом транспортной упаковки.\nГарантия на предлагаемый товар - 12 месяцев с момента поставки."]
[null,null,null,null,"Скидка, %:",0]
["№ п/п","Артикул","Наименование","Ед.\nИзм.","Кол-во","Цена, руб. с НДС","Сумма, \nруб. с НДС"]
[{"$f":"IF(A13=\"№ п/п\",1,A13+1)","v":1},null,{"$f":"IFERROR(INDEX(Прайс!B:B,MATCH(Предложение!B14,Прайс!A:A,0)),\"\")","v":""},{"$f":"IFERROR(INDEX(Прайс!C:C,MATCH(Предложение!B14,Прайс!A:A,0)),\"\")","v":""},null,{"$f":"IFERROR(INDEX(Прайс!D:D,MATCH(Предложение!B14,Прайс!A:A,0))*(100-$F$12)/100,\"\")","v":""},{"$f":"IFERROR(E14*F14,\"\")","v":""}]
[{"$f":"IF(A14=\"№ п/п\",1,A14+1)","v":2},null,{"$f":"IFERROR(INDEX(Прайс!B:B,MATCH(Предложение!B15,Прайс!A:A,0)),\"\")","v":""},{"$f":"IFERROR(INDEX(Прайс!C:C,MATCH(Предложение!B15,Прайс!A:A,0)),\"\")","v":""},null,{"$f":"IFERROR(INDEX(Прайс!D:D,MATCH(Предложение!B15,Прайс!A:A,0))*(100-$F$12)/100,\"\")","v":""},{"$f":"IFERROR(E15*F15,\"\")","v":""}]
[3,null,{"$f":"IFERROR(INDEX(Прайс!B:B,MATCH(Предложение!B16,Прайс!A:A,0)),\"\")","v":""},{"$f":"IFERROR(INDEX(Прайс!C:C,MATCH(Предложение!B16,Прайс!A:A,0)),\"\")","v":""},null,{"$f":"IFERROR(INDEX(Прайс!D:D,MATCH(Предложение!B16,Прайс!A:A,0))*(100-$F$12)/100,\"\")","v":""},""]
[4,null,{"$f":"IFERROR(INDEX(Прайс!B:B,MATCH(Предложение!B17,Прайс!A:A,0)),\"\")","v":""},{"$f":"IFERROR(INDEX(Прайс!C:C,MATCH(Предложение!B17,Прайс!A:A,0)),\"\")","v":""},null,{"$f":"IFERROR(INDEX(Прайс!D:D,MATCH(Предложение!B17,Прайс!A:A,0))*(100-$F$12)/100,\"\")","v":""},""]
[5,null,{"$f":"IFERROR(INDEX(Прайс!B:B,MATCH(Предложение!B18,Прайс!A:A,0)),\"\")","v":""},{"$f":"IFERROR(INDEX(Прайс!C:C,MATCH(Предложение!B18,Прайс!A:A,0)),\"\")","v":""},null,{"$f":"IFERROR(INDEX(Прайс!D:D,MATCH(Предложение!B18,Прайс!A:A,0))*(100-$F$12)/100,\"\")","v":""},""]
[6,null,{"$f":"IFERROR(INDEX(Прайс!B:B,MATCH(Предложение!B19,Прайс!A:A,0)),\"\")","v":""},{"$f":"IFERROR(INDEX(Прайс!C:C,MATCH(Предложение!B19,Прайс!A:A,0)),\"\")","v":""},null,{"$f":"IFERROR(INDEX(Прайс!D:D,MATCH(Предложение!B19,Прайс!A:A,0))*(100-$F$12)/100,\"\")","v":""},""]
[7,null,{"$f":"IFERROR(INDEX(Прайс!B:B,MATCH(Предложение!B20,Прайс!A:A,0)),\"\")","v":""},{"$f":"IFERROR(INDEX(Прайс!C:C,MATCH(Предложение!B20,Прайс!A:A,0)),\"\")","v":""},null,{"$f":"IFERROR(INDEX(Прайс!D:D,MATCH(Предложение!B20,Прайс!A:A,0))*(100-$F$12)/100,\"\")","v":""},""]
{"$rows_left_out":197}
{"sheet":"MPx_Add","index":1,"n_rows":230,"n_cols":62,"rows_kept":230,"cut":false,"hidden":true,"merged":[]}
[1,2,3,4,5,6,7,8,9,10,11,12,13,14,15,16,17,18,19,20,21,22,23,24,25,26,27,28,29,30,31,32,33,34,35,36,37,38,39,40,41,42,43,44,45,46,47,48,49,50,51,52,53,54,55,56,57,58,59,60,61,62]
[null,null,null,null,null,null,null,null,null,null,null,null,1,2,3,4,5,6,7,8,9,10,11,12,13,14,15,16,17,18,19,20,21,22,23,24,25,26,27,28,29,30,31,32,33,34,35,36,37,38,39,40,41,42,43,44,45,46,47,48,49,50]
[null,"- высота",null,"-ширина",null,null,"-глубина",null,"MPS","-серия"]
[{"$f":"CONCATENATE(A3/10,\".\",C3/10,\".\",F3/10)","v":"0.0.0"},"- артикул шкафа"]
[{"$f":"IFERROR(MATCH(CONCATENATE(\"MPS \",A4),M5:BJ5,0),MATCH(CONCATENATE(\"MPD \",A4),M5:BJ5,0))","v":{"$error":"#N/A"}},"- номер столбца","Value","Combo_Add","Check_caption_tmp","Check_caption_tmp","Combo_Index","Enabled","Check_Value","Артикул","Кол-во","Артикул","MPS 120.60.60","MPS 120.80.40","MPS 120.80.60","MPS 140.60.60","MPS 160.60.40","MPS 160.60.50","MPS 160.60.60","MPS 160.60.80","MPS 160.80.40","MPS 160.80.50","MPS 160.80.60","MPS 180.40.50","MPS 180.40.60","MPS 180.60.40","MPS 180.60.50","MPS 180.60.60","MPS 180.80.40","MPS 180.80.50","MPS 180.80.60","MPS 200.40.50","MPS 200.40.60","MPS 200.60.40","MPS 200.60.50","MPS 200.60.60","MPS 200.60.80","MPS 200.80.40","MPS 200.80.50","MPS 200.80.60","MPS 200.80.80","MPS 220.60.60","MPS 220.60.80","MPS 220.80.40","MPS 220.80.60","MPS 220.80.80","MPD 120.80.50","MPD 180.100.40","MPD 180.120.40","MPD 180.120.50","MPD 180.120.60","MPD 200.100.40","MPD 200.100.50","MPD 200.100.60","MPD 200.100.80","MPD 200.120.40","MPD 200.120.50","MPD 200.120.60","MPD 200.120.80","MPD 220.100.60","MPD 220.100.80","MPD 220.120.60"]
[null,null,null,null,"Combo_selected",null,null,null,null,null,null,"Серия","MPS","MPS","MPS","MPS","MPS","MPS","MPS","MPS","MPS","MPS","MPS","MPS","MPS","MPS","MPS","MPS","MPS","MPS","MPS","MPS","MPS","MPS","MPS","MPS","MPS","MPS","MPS","MPS","MPS","MPS","MPS","MPS","MPS","MPS","MPD","MPD","MPD","MPD","MPD","MPD","MPD","MPD","MPD","MPD","MPD","MPD","MPD","MPD","MPD","MPD"]
[null,null,null,null,null,null,null,null,null,null,null,"Высота",1200,1200,1200,1400,1600,1600,1600,1600,1600,1600,1600,1800,1800,1800,1800,1800,1800,1800,1800,2000,2000,2000,2000,2000,2000,2000,2000,2000,2000,2200,2200,2200,2200,2200,1200,1800,1800,1800,1800,2000,2000,2000,2000,2000,2000,2000,2000,2200,2200,2200]
["LastUsed Row",36,null,null,null,null,null,null,null,null,null,"Ширина",600,800,800,600,600,600,600,600,800,800,800,400,400,600,600,600,800,800,800,400,400,600,600,600,600,800,800,800,800,600,600,800,800,800,800,1000,1200,1200,1200,1000,1000,1000,1000,1200,1200,1200,1200,1000,1000,1200]
[null,null,null,null,null,null,null,null,null,null,null,"Глубина",600,400,600,600,400,500,600,800,400,500,600,500,600,400,500,600,400,500,600,500,600,400,500,600,800,400,500,600,800,600,800,400,600,800,500,400,400,500,600,400,500,600,800,400,500,600,800,600,800,600]
["PAGE1","Label4",{"$f":"IFERROR(CONCATENATE(J12,\" \",INDEX(Наименования!B:B,MATCH(MPx_Add!J12,Наименования!A:A,0))),\"пусто\")","v":"пусто"},null,null,null,null,null,null,null,1,"Артикул+Наименование"]
["PAGE1","Label7",{"$f":"IFERROR(INDEX(Наименования!C:C,MATCH(MPx_Add!J12,Наименования!A:A,0)),\"пусто\")","v":"пусто"},null,null,null,null,null,null,null,1,"Комплект поставки"]
["PAGE1","TextBox1",null,null,null,null,null,null,null,{"$f":"IFERROR(INDEX(M5:BJ5,1,A5),\"\")","v":""},1,"Кол-во шкафов"]
["PAGE1","CheckBox20",{"$f":"IFERROR(INDEX(M13:BJ13,1,$A$5),\"пусто\")","v":"пусто"},null,{"$f":"IF(OR(F13=\"0- \",F13=\"0-\"),\"Боковые стенки\",F13)","v":"пусто "},{"$f":"IFERROR(CONCATENATE(C13,\" \",INDEX(Наименования!B:B,MATCH(C13,Наименования!A:A,0))),\"пусто\")","v":"пусто "},null,{"$f":"IF(E13=F13,TRUE,FALSE)","v":true},null,{"$f":"IFERROR(IF(I13,C13,\"\"),\"\")","v":""},1,"Боковые стенки","SP 120.60","SP 120.40","SP 120.60","SP 140.60","SP 160.40","SP 160.50","SP 160.60","SP 160.80","SP 160.40","SP 160.50","SP 160.60","SP 180.50","SP 180.60","SP 180.40","SP 180.50","SP 180.60","SP 180.40","SP 180.50","SP 180.60","SP 200.50","SP 200.60","SP 200.40","SP 200.50","SP 200.60","SP 200.80","SP 200.40","SP 200.50","SP 200.60","SP 200.80","SP 220.60","SP 220.80","SP 220.40","SP 220.60","SP 220.80","SP 120.50","SP 180.40","SP 180.40","SP 180.50","SP 180.60","SP 200.40","SP 200.50","SP 200.60","SP 200.80","SP 200.40","SP 200.50","SP 200.60","SP 200.80","SP 220.60","SP 220.80","SP 220.60"]
["PAGE1","CheckBox31",{"$f":"IFERROR(INDEX(C15:C17,G14),\"пусто\")","v":"пусто"},null,null,null,{"$f":"MATCH(E15,D15:D17,0)","v":{"$error":"#N/A"}},null,null,{"$f":"IFERROR(IF(I14,C14,\"\"),\"\")","v":""},1,"Задняя плоскость"]
["PAGE1","ComboBox13_1",{"$f":"IFERROR(INDEX(M15:BJ15,1,$A$5),\"пусто\")","v":"пусто"},{"$f":"CONCATENATE(C15,\" \",INDEX(Наименования!B:B,MATCH(MPx_Add!C15,Наименования!A:A,0)))","v":"пусто "},"D 180.80 Дверь шкафа MPx одностворчатая 1800х800мм 1шт",null,null,null,null,null,1,"Задняя плоскость-дверь 1х","D 120.60","D 120.80","D 120.80","D 140.60","D 160.60","D 160.60","D 160.60","D 160.60","D 160.80","D 160.80","D 160.80","D 180.40","D 180.40","D 180.60","D 180.60","D 180.60","D 180.80","D 180.80","D 180.80","D 200.40","D 200.40","D 200.60","D 200.60","D 200.60","D 200.60","D 200.80","D 200.80","D 200.80","D 200.80","D 220.60","D 220.60","D 220.80","D 220.80","D 220.80","D 120.80","0-","0-","0-","0-","0-","0-","0-","0-","0-","0-","0-","0-","0-","0-","0-"]
["PAGE1","ComboBox13_2",{"$f":"IFERROR(INDEX(M16:BJ16,1,$A$5),\"пусто\")","v":"пусто"},{"$f":"CONCATENATE(C16,\" \",INDEX(Наименования!B:B,MATCH(MPx_Add!C16,Наименования!A:A,0)))","v":"пусто "},null,null,null,null,null,null,1,"Задняя плоскость-дверь 2х","0-","0-","0-","0-","0-","0-","0-","0-","0-","0-","0-","0-","0-","0-","0-","0-","D 180.80 D","D 180.80 D","D 180.80 D","0-","0-","D 200.60 D","D 200.60 D","D 200.60 D","D 200.60 D","D 200.80 D","D 200.80 D","D 200.80 D","D 200.80 D","0-","0-","D 220.80 D","D 220.80 D","D 220.80 D","0-","D 180.100 D","D 180.120 D","D 180.120 D","D 180.120 D","D 200.100 D","D 200.100 D","D 200.100 D","D 200.100 D","D 200.120 D","D 200.120 D","D 200.120 D","D 200.120 D","D 220.100 D","D 220.100 D","D 220.120 D"]
["PAGE1","ComboBox13_3",{"$f":"IFERROR(INDEX(M17:BJ17,1,$A$5),\"пусто\")","v":"пусто"},"Оставить сплошную панель",null,null,null,null,null,null,1,"Оставить сплошную панель"]
["PAGE1","CheckBox41",{"$f":"IFERROR(INDEX(C19:C22,G18),\"пусто\")","v":"пусто"},null,null,null,{"$f":"MATCH(E19,D19:D22,0)","v":{"$error":"#N/A"}},null,null,{"$f":"IFERROR(IF(I18,C18,\"\"),\"\")","v":""},1,"Доп. Монтажная панель"]
["PAGE1","ComboBox18_1",{"$f":"IFERROR(INDEX(M19:BJ19,1,$A$5),\"пусто\")","v":"пусто"},{"$f":"CONCATENATE(C19,\" \",INDEX(Наименования!B:B,MATCH(MPx_Add!C19,Наименования!A:A,0)))","v":"пусто "},"MP 200.80 Монтажная панель MPx 2000x800мм 1шт",null,null,null,null,null,1,"МП сплошная","MP 120.60","MP 120.80","MP 120.80","0-","MP 160.60","MP 160.60","MP 160.60","MP 160.60","MP 160.80","MP 160.80","MP 160.80","MP 180.40","MP 180.40","MP 180.60","MP 180.60","MP 180.60","MP 180.80","MP 180.80","MP 180.80","MP 200.40","MP 200.40","MP 200.60","MP 200.60","MP 200.60","MP 200.60","MP 200.80","MP 200.80","MP 200.80","MP 200.80","MP 220.60","MP 220.60","MP 220.80","MP 220.80","MP 220.80","MP 120.80","MP 180.100","MP 180.120","MP 180.120","MP 180.120","MP 200.100","MP 200.100","MP 200.100","MP 200.100","MP 200.120","MP 200.120","MP 200.120","MP 200.120","MP 220.100","MP 220.100","MP 220.120"]
["PAGE1","ComboBox18_2","пусто",{"$f":"CONCATENATE(C20,\" \",INDEX(Наименования!B:B,MATCH(MPx_Add!C20,Наименования!A:A,0)))","v":"пусто "},null,null,null,null,null,null,1,"МП микроперфорация","0-","0-","0-","0-","0-","0-","0-","0-","0-","0-","0-","0-","0-","MP 180.60 P","MP 180.60 P","MP 180.60 P","MP 180.80 P","MP 180.80 P","MP 180.80 P","0-","0-","MP 200.60 P","MP 200.60 P","MP 200.60 P","MP 200.60 P","MP 200.80 P","MP 200.80 P","MP 200.80 P","MP 200.80 P","MP 220.60 P","MP 220.60 P","MP 220.80 P","MP 220.80 P","MP 220.80 P","0-","MP 180.100 P","MP 180.120 P","MP 180.120 P","MP 180.120 P","MP 200.100 P","MP 200.100 P","MP 200.100 P","MP 200.100 P","MP 200.120 P","MP 200.120 P","MP 200.120 P","MP 200.120 P","0-","0-","MP 220.120 P"]
{"$rows_left_out":211}
{"sheet":"Наименования","index":2,"n_rows":624,"n_cols":4,"rows_kept":624,"cut":false,"hidden":true,"merged":[]}
["Характеристика","Наименование для конфигуратора","Компл.пост.","Ед.изм"]
["DR 07.125","DIN-рейка 35х7,5х125мм для ширины 200мм 10шт",null,"уп."]
["DR 07.2000","DIN-рейка 35х7,5х2000мм 10шт",null,"уп."]
["DR 07.225","DIN-рейка 35х7,5х225мм для шкафа шириной 300мм 10шт",null,"уп."]
["DR 07.325","DIN-рейка 35х7,5х325мм для шкафа шириной 400мм 10шт",null,"уп."]
["DR 07.525","DIN-рейка 35х7,5х525мм для шкафа шириной 600мм 10шт",null,"уп."]
["DR 07.725","DIN-рейка 35х7,5х725мм для шкафа шириной 800мм 10шт",null,"уп."]
["DR 15.125","DIN-рейка 35х15х125мм для шкафа шириной 200мм 10шт",null,"уп."]
["DR 15.2000","DIN-рейка 35х15х2000мм 10шт",null,"уп."]
["DR 15.225","DIN-рейка 35х15х225мм для шкафа шириной 300мм 10шт",null,"уп."]
["DR 15.325","DIN-рейка 35х15х325мм для шкафа шириной 400мм 10шт",null,"уп."]
["DR 15.525","DIN-рейка 35х15х525мм для шкафа шириной 600мм 10шт",null,"уп."]
["DR 15.725","DIN-рейка 35х15х725мм для шкафа шириной 800мм 10шт",null,"уп."]
["ZA 00.40 K v.2","Боковые панели цоколя 100х400мм с щеточным вводом 2шт",null,"уп."]
["ZA 00.60 K v.2","Боковые панели цоколя 100х600мм с щеточным вводом 2шт",null,"уп."]
["ZA 00.80 K v.2","Боковые панели цоколя 100х800мм с щеточным вводом 2шт",null,"уп."]
["ZA 00.25 v.2","Боковые панели цоколя 100х250мм 2шт",null,"уп."]
["ZA 00.30 v.2","Боковые панели цоколя 100х300мм 2шт",null,"уп."]
["ZA 00.40 H v.2","Боковые панели цоколя 200х400мм 2шт",null,"уп."]
["ZA 00.40 v.2","Боковые панели цоколя 100х400мм 2шт",null,"уп."]
{"$rows_left_out":605}
{"sheet":"Прайс","index":3,"n_rows":2114,"n_cols":4,"rows_kept":2114,"cut":false,"hidden":false,"merged":[]}
["Код продукции","Расшифровка","Ед.изм","Прайс цена, руб с НДС"]
["DR 07.135","DIN - рейка для коробок распределительных, 10шт.","комп",675]
["DR 07.185","DIN - рейка для коробок распределительных, 10шт.","комп",925]
["DR 07.285","DIN - рейка для коробок распределительных, 10шт.","комп",1425]
["DR 07.385","DIN - рейка для коробок распределительных, 10шт.","комп",1925]
["DR 15.425","DIN - рейка для модульной рамы, 10шт.","комп",3052]
["DR 15.625","DIN - рейка для модульной рамы, 10шт.","комп",6451]
["DR 07.125","DIN - рейка, 10шт.","комп",1725]
["DR 07.2000","DIN - рейка, 10шт.","комп",12793]
["DR 07.225","DIN - рейка, 10шт.","комп",1318]
["DR 07.325","DIN - рейка, 10шт.","комп",1679]
["DR 07.525","DIN - рейка, 10шт.","комп",2677]
["DR 07.725","DIN - рейка, 10шт.","комп",3724]
["DR 15.125","DIN - рейка, 10шт.","комп",1461]
["DR 15.2000","DIN - рейка, 10шт.","комп",22491]
["DR 15.225","DIN - рейка, 10шт.","комп",2386]
["DR 15.325","DIN - рейка, 10шт.","комп",2789]
["DR 15.525","DIN - рейка, 10шт.","комп",4213]
["DR 15.725","DIN - рейка, 10шт.","комп",7311]
["MF 40 D","Балка для рамы MF","шт",1010]
{"$rows_left_out":2094}