{"text_format":"1","workbook":"xlsx","n_sheets":4,"sheets":["Предложение","MPx_Add","Наименования","Прайс"],"not_rendered":{"charts":0,"images":1,"macros":1,"external_links":0,"defined_names":3,"comments":0,"pivot_tables":0},"unopened":[],"bounds":{"document_bytes":16777216,"sheet_cells":100000,"rows_first":2000,"rows_last":500,"rows_between":2000,"halvings":0,"cell_chars":16384,"cell_head_chars":4096},"cells_cut":0,"cells_raw":0,"read":"whole","date_system":"1900"}

{"sheet":"Предложение","index":0,"n_rows":216,"n_cols":7,"rows_kept":216,"cut":false,"hidden":false,"merged":[[10,2,10,6],[10,0,10,1],[7,0,7,1],[7,2,7,6],[3,0,3,1],[5,0,5,1],[3,2,3,6],[5,2,5,6],[8,2,8,6],[9,2,9,6]]}
[{"$f":"CONCATENATE(\"КОММЕРЧЕСКОЕ ПРЕДЛОЖЕНИЕ от \",TEXT(TODAY(),\"ДД.ММ.ГГ\"))","v":"КОММЕРЧЕСКОЕ ПРЕДЛОЖЕНИЕ от 22.07.24"}]
[{"$f":"CONCATENATE(\"Срок действия: \",TEXT(TODAY()+30,\"ДД.ММ.ГГ\"))","v":"Срок действия: 21.08.24"}]
[]
["От:",null,"ООО «СпецТехСнаб»,  Иванов И.И., ivan.ivanov@provento.ru, +7-999-888-77-66"]
[]
["Кому:",null,"ООО «Газпром трансгаз Ухта», Петров П.П., p.petrov@gazprom.ru, +7-888-777-66-55"]
[]
["Условия оплаты:",null,"Предоплата в размере 30% от суммы КП, окончательный расчет в течении 60 дней после подписания Покупателем Товарной накладной."]
[null,"Срок поставки:","2 недели с момента поступления предоплаты на р/сч Поставщика"]
[null,"Базис поставки:","DDP 169300, РФ, Республика Коми, г. Ухта, набережная Газовиков 10/1"]
["Примечания:",null,"Стоимость предлагаемой продукции указана с учетом транспортной упаковки.\nГарантия на предлагаемый товар - 12 месяцев с момента поставки."]
[null,null,null,null,"Скидка, %:",0]
["№ п/п","Артикул","Наименование","Ед.\nИзм.","Кол-во","Цена, руб. с НДС","Сумма, \nруб. с НДС"]
[{"$f":"IF(A13=\"№ п/п\",1,A13+1)","v":1},null,{"$f":"IFERROR(INDEX(Прайс!B:B,MATCH(Предложение!B14,Прайс!A:A,0)),\"\")","v":""},{"$f":"IFERROR(INDEX(Прайс!C:C,MATCH(Предложение!B14,Прайс!A:A,0)),\"\")","v":""},null,{"$f":"IFERROR(INDEX(Прайс!D:D,MATCH(Предложение!B14,Прайс!A:A,0))*(100-$F$12)/100,\"\")","v":""},{"$f":"IFERROR(E14*F14,\"\")","v":""}]
[{"$f":"IF(A14=\"№ п/п\",1,A14+1)","v":2},null,{"$f":"IFERROR(INDEX(Прайс!B:B,MATCH(Предложение!B15,Прайс!A:A,0)),\"\")","v":""},{"$f":"IFERROR(INDEX(Прайс!C:C,MATCH(Предложение!B15,Прайс!A:A,0)),\"\")","v":""},null,{"$f":"IFERROR(INDEX(Прайс!D:D,MATCH(Предложение!B15,Прайс!A:A,0))*(100-$F$12)/100,\"\")","v":""},{"$f":"IFERROR(E15*F15,\"\")","v":""}]
[3,null,{"$f":"IFERROR(INDEX(Прайс!B:B,MATCH(Предложение!B16,Прайс!A:A,0)),\"\")","v":""},{"$f":"IFERROR(INDEX(Прайс!C:C,MATCH(Предложение!B16,Прайс!A:A,0)),\"\")","v":""},null,{"$f":"IFERROR(INDEX(Прайс!D:D,MATCH(Предложение!B16,Прайс!A:A,0))*(100-$F$12)/100,\"\")","v":""},""]
[4,null,{"$f":"IFERROR(INDEX(Прайс!B:B,MATCH(Предложение!B17,Прайс!A:A,0)),\"\")","v":""},{"$f":"IFERROR(INDEX(Прайс!C:C,MATCH(Предложение!B17,Прайс!A:A,0)),\"\")","v":""},null,{"$f":"IFERROR(INDEX(Прайс!D:D,MATCH(Предложение!B17,Прайс!A:A,0))*(100-$F$12)/100,\"\")","v":""},""]
[5,null,{"$f":"IFERROR(INDEX(Прайс!B:B,MATCH(Предложение!B18,Прайс!A:A,0)),\"\")","v":""},{"$f":"IFERROR(INDEX(Прайс!C:C,MATCH(Предложение!B18,Прайс!A:A,0)),\"\")","v":""},null,{"$f":"IFERROR(INDEX(Прайс!D:D,MATCH(Предложение!B18,Прайс!A:A,0))*(100-$F$12)/100,\"\")","v":""},""]
[6,null,{"$f":"IFERROR(INDEX(Прайс!B:B,MATCH(Предложение!B19,Прайс!A:A,0)),\"\")","v":""},{"$f":"IFERROR(INDEX(Прайс!C:C,MATCH(Предложение!B19,Прайс!A:A,0)),\"\")","v":""},null,{"$f":"IFERROR(INDEX(Прайс!D:D,MATCH(Предложение!B19,Прайс!A:A,0))*(100-$F$12)/100,\"\")","v":""},""]
[7,null,{"$f":"IFERROR(INDEX(Прайс!B:B,MATCH(Предложение!B20,Прайс!A:A,0)),\"\")","v":""},{"$f":"IFERROR(INDEX(Прайс!C:C,MATCH(Предложение!B20,Прайс!A:A,0)),\"\")","v":""},null,{"$f":"IFERROR(INDEX(Прайс!D:D,MATCH(Предложение!B20,Прайс!A:A,0))*(100-$F$12)/100,\"\")","v":""},""]
[8,null,{"$f":"IFERROR(INDEX(Прайс!B:B,MATCH(Предложение!B21,Прайс!A:A,0)),\"\")","v":""},{"$f":"IFERROR(INDEX(Прайс!C:C,MATCH(Предложение!B21,Прайс!A:A,0)),\"\")","v":""},null,{"$f":"IFERROR(INDEX(Прайс!D:D,MATCH(Предложение!B21,Прайс!A:A,0))*(100-$F$12)/100,\"\")","v":""},""]
[9,null,{"$f":"IFERROR(INDEX(Прайс!B:B,MATCH(Предложение!B22,Прайс!A:A,0)),\"\")","v":""},{"$f":"IFERROR(INDEX(Прайс!C:C,MATCH(Предложение!B22,Прайс!A:A,0)),\"\")","v":""},null,{"$f":"IFERROR(INDEX(Прайс!D:D,MATCH(Предложение!B22,Прайс!A:A,0))*(100-$F$12)/100,\"\")","v":""},""]
[10,null,{"$f":"IFERROR(INDEX(Прайс!B:B,MATCH(Предложение!B23,Прайс!A:A,0)),\"\")","v":""},{"$f":"IFERROR(INDEX(Прайс!C:C,MATCH(Предложение!B23,Прайс!A:A,0)),\"\")","v":""},null,{"$f":"IFERROR(INDEX(Прайс!D:D,MATCH(Предложение!B23,Прайс!A:A,0))*(100-$F$12)/100,\"\")","v":""},""]
[11,null,{"$f":"IFERROR(INDEX(Прайс!B:B,MATCH(Предложение!B24,Прайс!A:A,0)),\"\")","v":""},{"$f":"IFERROR(INDEX(Прайс!C:C,MATCH(Предложение!B24,Прайс!A:A,0)),\"\")","v":""},null,{"$f":"IFERROR(INDEX(Прайс!D:D,MATCH(Предложение!B24,Прайс!A:A,0))*(100-$F$12)/100,\"\")","v":""},""]
[12,null,{"$f":"IFERROR(INDEX(Прайс!B:B,MATCH(Предложение!B25,Прайс!A:A,0)),\"\")","v":""},{"$f":"IFERROR(INDEX(Прайс!C:C,MATCH(Предложение!B25,Прайс!A:A,0)),\"\")","v":""},null,{"$f":"IFERROR(INDEX(Прайс!D:D,MATCH(Предложение!B25,Прайс!A:A,0))*(100-$F$12)/100,\"\")","v":""},""]
[13,null,{"$f":"IFERROR(INDEX(Прайс!B:B,MATCH(Предложение!B26,Прайс!A:A,0)),\"\")","v":""},{"$f":"IFERROR(INDEX(Прайс!C:C,MATCH(Предложение!B26,Прайс!A:A,0)),\"\")","v":""},null,{"$f":"IFERROR(INDEX(Прайс!D:D,MATCH(Предложение!B26,Прайс!A:A,0))*(100-$F$12)/100,\"\")","v":""},""]
[14,null,{"$f":"IFERROR(INDEX(Прайс!B:B,MATCH(Предложение!B27,Прайс!A:A,0)),\"\")","v":""},{"$f":"IFERROR(INDEX(Прайс!C:C,MATCH(Предложение!B27,Прайс!A:A,0)),\"\")","v":""},null,{"$f":"IFERROR(INDEX(Прайс!D:D,MATCH(Предложение!B27,Прайс!A:A,0))*(100-$F$12)/100,\"\")","v":""},""]
[15,null,{"$f":"IFERROR(INDEX(Прайс!B:B,MATCH(Предложение!B28,Прайс!A:A,0)),\"\")","v":""},{"$f":"IFERROR(INDEX(Прайс!C:C,MATCH(Предложение!B28,Прайс!A:A,0)),\"\")","v":""},null,{"$f":"IFERROR(INDEX(Прайс!D:D,MATCH(Предложение!B28,Прайс!A:A,0))*(100-$F$12)/100,\"\")","v":""},""]
[16,null,{"$f":"IFERROR(INDEX(Прайс!B:B,MATCH(Предложение!B29,Прайс!A:A,0)),\"\")","v":""},{"$f":"IFERROR(INDEX(Прайс!C:C,MATCH(Предложение!B29,Прайс!A:A,0)),\"\")","v":""},null,{"$f":"IFERROR(INDEX(Прайс!D:D,MATCH(Предложение!B29,Прайс!A:A,0))*(100-$F$12)/100,\"\")","v":""},""]
[17,null,{"$f":"IFERROR(INDEX(Прайс!B:B,MATCH(Предложение!B30,Прайс!A:A,0)),\"\")","v":""},{"$f":"IFERROR(INDEX(Прайс!C:C,MATCH(Предложение!B30,Прайс!A:A,0)),\"\")","v":""},null,{"$f":"IFERROR(INDEX(Прайс!D:D,MATCH(Предложение!B30,Прайс!A:A,0))*(100-$F$12)/100,\"\")","v":""},""]
[18,null,{"$f":"IFERROR(INDEX(Прайс!B:B,MATCH(Предложение!B31,Прайс!A:A,0)),\"\")","v":""},{"$f":"IFERROR(INDEX(Прайс!C:C,MATCH(Предложение!B31,Прайс!A:A,0)),\"\")","v":""},null,{"$f":"IFERROR(INDEX(Прайс!D:D,MATCH(Предложение!B31,Прайс!A:A,0))*(100-$F$12)/100,\"\")","v":""},""]
[19,null,{"$f":"IFERROR(INDEX(Прайс!B:B,MATCH(Предложение!B32,Прайс!A:A,0)),\"\")","v":""},{"$f":"IFERROR(INDEX(Прайс!C:C,MATCH(Предложение!B32,Прайс!A:A,0)),\"\")","v":""},null,{"$f":"IFERROR(INDEX(Прайс!D:D,MATCH(Предложение!B32,Прайс!A:A,0))*(100-$F$12)/100,\"\")","v":""},""]
[20,null,{"$f":"IFERROR(INDEX(Прайс!B:B,MATCH(Предложение!B33,Прайс!A:A,0)),\"\")","v":""},{"$f":"IFERROR(INDEX(Прайс!C:C,MATCH(Предложение!B33,Прайс!A:A,0)),\"\")","v":""},null,{"$f":"IFERROR(INDEX(Прайс!D:D,MATCH(Предложение!B33,Прайс!A:A,0))*(100-$F$12)/100,\"\")","v":""},""]
[21,null,{"$f":"IFERROR(INDEX(Прайс!B:B,MATCH(Предложение!B34,Прайс!A:A,0)),\"\")","v":""},{"$f":"IFERROR(INDEX(Прайс!C:C,MATCH(Предложение!B34,Прайс!A:A,0)),\"\")","v":""},null,{"$f":"IFERROR(INDEX(Прайс!D:D,MATCH(Предложение!B34,Прайс!A:A,0))*(100-$F$12)/100,\"\")","v":""},""]
[22,null,{"$f":"IFERROR(INDEX(Прайс!B:B,MATCH(Предложение!B35,Прайс!A:A,0)),\"\")","v":""},{"$f":"IFERROR(INDEX(Прайс!C:C,MATCH(Предложение!B35,Прайс!A:A,0)),\"\")","v":""},null,{"$f":"IFERROR(INDEX(Прайс!D:D,MATCH(Предложение!B35,Прайс!A:A,0))*(100-$F$12)/100,\"\")","v":""},""]
[23,null,{"$f":"IFERROR(INDEX(Прайс!B:B,MATCH(Предложение!B36,Прайс!A:A,0)),\"\")","v":""},{"$f":"IFERROR(INDEX(Прайс!C:C,MATCH(Предложение!B36,Прайс!A:A,0)),\"\")","v":""},null,{"$f":"IFERROR(INDEX(Прайс!D:D,MATCH(Предложение!B36,Прайс!A:A,0))*(100-$F$12)/100,\"\")","v":""},""]
[24,null,{"$f":"IFERROR(INDEX(Прайс!B:B,MATCH(Предложение!B37,Прайс!A:A,0)),\"\")","v":""},{"$f":"IFERROR(INDEX(Прайс!C:C,MATCH(Предложение!B37,Прайс!A:A,0)),\"\")","v":""},null,{"$f":"IFERROR(INDEX(Прайс!D:D,MATCH(Предложение!B37,Прайс!A:A,0))*(100-$F$12)/100,\"\")","v":""},""]
[25,null,{"$f":"IFERROR(INDEX(Прайс!B:B,MATCH(Предложение!B38,Прайс!A:A,0)),\"\")","v":""},{"$f":"IFERROR(INDEX(Прайс!C:C,MATCH(Предложение!B38,Прайс!A:A,0)),\"\")","v":""},null,{"$f":"IFERROR(INDEX(Прайс!D:D,MATCH(Предложение!B38,Прайс!A:A,0))*(100-$F$12)/100,\"\")","v":""},""]
[26,null,{"$f":"IFERROR(INDEX(Прайс!B:B,MATCH(Предложение!B39,Прайс!A:A,0)),\"\")","v":""},{"$f":"IFERROR(INDEX(Прайс!C:C,MATCH(Предложение!B39,Прайс!A:A,0)),\"\")","v":""},null,{"$f":"IFERROR(INDEX(Прайс!D:D,MATCH(Предложение!B39,Прайс!A:A,0))*(100-$F$12)/100,\"\")","v":""},""]
[27,null,{"$f":"IFERROR(INDEX(Прайс!B:B,MATCH(Предложение!B40,Прайс!A:A,0)),\"\")","v":""},{"$f":"IFERROR(INDEX(Прайс!C:C,MATCH(Предложение!B40,Прайс!A:A,0)),\"\")","v":""},null,{"$f":"IFERROR(INDEX(Прайс!D:D,MATCH(Предложение!B40,Прайс!A:A,0))*(100-$F$12)/100,\"\")","v":""},""]
[28,null,{"$f":"IFERROR(INDEX(Прайс!B:B,MATCH(Предложение!B41,Прайс!A:A,0)),\"\")","v":""},{"$f":"IFERROR(INDEX(Прайс!C:C,MATCH(Предложение!B41,Прайс!A:A,0)),\"\")","v":""},null,{"$f":"IFERROR(INDEX(Прайс!D:D,MATCH(Предложение!B41,Прайс!A:A,0))*(100-$F$12)/100,\"\")","v":""},""]
[29,null,{"$f":"IFERROR(INDEX(Прайс!B:B,MATCH(Предложение!B42,Прайс!A:A,0)),\"\")","v":""},{"$f":"IFERROR(INDEX(Прайс!C:C,MATCH(Предложение!B42,Прайс!A:A,0)),\"\")","v":""},null,{"$f":"IFERROR(INDEX(Прайс!D:D,MATCH(Предложение!B42,Прайс!A:A,0))*(100-$F$12)/100,\"\")","v":""},""]
[30,null,{"$f":"IFERROR(INDEX(Прайс!B:B,MATCH(Предложение!B43,Прайс!A:A,0)),\"\")","v":""},{"$f":"IFERROR(INDEX(Прайс!C:C,MATCH(Предложение!B43,Прайс!A:A,0)),\"\")","v":""},null,{"$f":"IFERROR(INDEX(Прайс!D:D,MATCH(Предложение!B43,Прайс!A:A,0))*(100-$F$12)/100,\"\")","v":""},""]
[31,null,{"$f":"IFERROR(INDEX(Прайс!B:B,MATCH(Предложение!B44,Прайс!A:A,0)),\"\")","v":""},{"$f":"IFERROR(INDEX(Прайс!C:C,MATCH(Предложение!B44,Прайс!A:A,0)),\"\")","v":""},null,{"$f":"IFERROR(INDEX(Прайс!D:D,MATCH(Предложение!B44,Прайс!A:A,0))*(100-$F$12)/100,\"\")","v":""},""]
[32,null,{"$f":"IFERROR(INDEX(Прайс!B:B,MATCH(Предложение!B45,Прайс!A:A,0)),\"\")","v":""},{"$f":"IFERROR(INDEX(Прайс!C:C,MATCH(Предложение!B45,Прайс!A:A,0)),\"\")","v":""},null,{"$f":"IFERROR(INDEX(Прайс!D:D,MATCH(Предложение!B45,Прайс!A:A,0))*(100-$F$12)/100,\"\")","v":""},""]
[33,null,{"$f":"IFERROR(INDEX(Прайс!B:B,MATCH(Предложение!B46,Прайс!A:A,0)),\"\")","v":""},{"$f":"IFERROR(INDEX(Прайс!C:C,MATCH(Предложение!B46,Прайс!A:A,0)),\"\")","v":""},null,{"$f":"IFERROR(INDEX(Прайс!D:D,MATCH(Предложение!B46,Прайс!A:A,0))*(100-$F$12)/100,\"\")","v":""},""]
[34,null,{"$f":"IFERROR(INDEX(Прайс!B:B,MATCH(Предложение!B47,Прайс!A:A,0)),\"\")","v":""},{"$f":"IFERROR(INDEX(Прайс!C:C,MATCH(Предложение!B47,Прайс!A:A,0)),\"\")","v":""},null,{"$f":"IFERROR(INDEX(Прайс!D:D,MATCH(Предложение!B47,Прайс!A:A,0))*(100-$F$12)/100,\"\")","v":""},""]
[35,null,{"$f":"IFERROR(INDEX(Прайс!B:B,MATCH(Предложение!B48,Прайс!A:A,0)),\"\")","v":""},{"$f":"IFERROR(INDEX(Прайс!C:C,MATCH(Предложение!B48,Прайс!A:A,0)),\"\")","v":""},null,{"$f":"IFERROR(INDEX(Прайс!D:D,MATCH(Предложение!B48,Прайс!A:A,0))*(100-$F$12)/100,\"\")","v":""},""]
[36,null,{"$f":"IFERROR(INDEX(Прайс!B:B,MATCH(Предложение!B49,Прайс!A:A,0)),\"\")","v":""},{"$f":"IFERROR(INDEX(Прайс!C:C,MATCH(Предложение!B49,Прайс!A:A,0)),\"\")","v":""},null,{"$f":"IFERROR(INDEX(Прайс!D:D,MATCH(Предложение!B49,Прайс!A:A,0))*(100-$F$12)/100,\"\")","v":""},""]
[37,null,{"$f":"IFERROR(INDEX(Прайс!B:B,MATCH(Предложение!B50,Прайс!A:A,0)),\"\")","v":""},{"$f":"IFERROR(INDEX(Прайс!C:C,MATCH(Предложение!B50,Прайс!A:A,0)),\"\")","v":""},null,{"$f":"IFERROR(INDEX(Прайс!D:D,MATCH(Предложение!B50,Прайс!A:A,0))*(100-$F$12)/100,\"\")","v":""},""]
[38,null,{"$f":"IFERROR(INDEX(Прайс!B:B,MATCH(Предложение!B51,Прайс!A:A,0)),\"\")","v":""},{"$f":"IFERROR(INDEX(Прайс!C:C,MATCH(Предложение!B51,Прайс!A:A,0)),\"\")","v":""},null,{"$f":"IFERROR(INDEX(Прайс!D:D,MATCH(Предложение!B51,Прайс!A:A,0))*(100-$F$12)/100,\"\")","v":""},""]
[39,null,{"$f":"IFERROR(INDEX(Прайс!B:B,MATCH(Предложение!B52,Прайс!A:A,0)),\"\")","v":""},{"$f":"IFERROR(INDEX(Прайс!C:C,MATCH(Предложение!B52,Прайс!A:A,0)),\"\")","v":""},null,{"$f":"IFERROR(INDEX(Прайс!D:D,MATCH(Предложение!B52,Прайс!A:A,0))*(100-$F$12)/100,\"\")","v":""},""]
[40,null,{"$f":"IFERROR(INDEX(Прайс!B:B,MATCH(Предложение!B53,Прайс!A:A,0)),\"\")","v":""},{"$f":"IFERROR(INDEX(Прайс!C:C,MATCH(Предложение!B53,Прайс!A:A,0)),\"\")","v":""},null,{"$f":"IFERROR(INDEX(Прайс!D:D,MATCH(Предложение!B53,Прайс!A:A,0))*(100-$F$12)/100,\"\")","v":""},""]
[41,null,{"$f":"IFERROR(INDEX(Прайс!B:B,MATCH(Предложение!B54,Прайс!A:A,0)),\"\")","v":""},{"$f":"IFERROR(INDEX(Прайс!C:C,MATCH(Предложение!B54,Прайс!A:A,0)),\"\")","v":""},null,{"$f":"IFERROR(INDEX(Прайс!D:D,MATCH(Предложение!B54,Прайс!A:A,0))*(100-$F$12)/100,\"\")","v":""},""]
[42,null,{"$f":"IFERROR(INDEX(Прайс!B:B,MATCH(Предложение!B55,Прайс!A:A,0)),\"\")","v":""},{"$f":"IFERROR(INDEX(Прайс!C:C,MATCH(Предложение!B55,Прайс!A:A,0)),\"\")","v":""},null,{"$f":"IFERROR(INDEX(Прайс!D:D,MATCH(Предложение!B55,Прайс!A:A,0))*(100-$F$12)/100,\"\")","v":""},""]
[43,null,{"$f":"IFERROR(INDEX(Прайс!B:B,MATCH(Предложение!B56,Прайс!A:A,0)),\"\")","v":""},{"$f":"IFERROR(INDEX(Прайс!C:C,MATCH(Предложение!B56,Прайс!A:A,0)),\"\")","v":""},null,{"$f":"IFERROR(INDEX(Прайс!D:D,MATCH(Предложение!B56,Прайс!A:A,0))*(100-$F$12)/100,\"\")","v":""},""]
[44,null,{"$f":"IFERROR(INDEX(Прайс!B:B,MATCH(Предложение!B57,Прайс!A:A,0)),\"\")","v":""},{"$f":"IFERROR(INDEX(Прайс!C:C,MATCH(Предложение!B57,Прайс!A:A,0)),\"\")","v":""},null,{"$f":"IFERROR(INDEX(Прайс!D:D,MATCH(Предложение!B57,Прайс!A:A,0))*(100-$F$12)/100,\"\")","v":""},""]
[45,null,{"$f":"IFERROR(INDEX(Прайс!B:B,MATCH(Предложение!B58,Прайс!A:A,0)),\"\")","v":""},{"$f":"IFERROR(INDEX(Прайс!C:C,MATCH(Предложение!B58,Прайс!A:A,0)),\"\")","v":""},null,{"$f":"IFERROR(INDEX(Прайс!D:D,MATCH(Предложение!B58,Прайс!A:A,0))*(100-$F$12)/100,\"\")","v":""},""]
[46,null,{"$f":"IFERROR(INDEX(Прайс!B:B,MATCH(Предложение!B59,Прайс!A:A,0)),\"\")","v":""},{"$f":"IFERROR(INDEX(Прайс!C:C,MATCH(Предложение!B59,Прайс!A:A,0)),\"\")","v":""},null,{"$f":"IFERROR(INDEX(Прайс!D:D,MATCH(Предложение!B59,Прайс!A:A,0))*(100-$F$12)/100,\"\")","v":""},""]
[47,null,{"$f":"IFERROR(INDEX(Прайс!B:B,MATCH(Предложение!B60,Прайс!A:A,0)),\"\")","v":""},{"$f":"IFERROR(INDEX(Прайс!C:C,MATCH(Предложение!B60,Прайс!A:A,0)),\"\")","v":""},null,{"$f":"IFERROR(INDEX(Прайс!D:D,MATCH(Предложение!B60,Прайс!A:A,0))*(100-$F$12)/100,\"\")","v":""},""]
[48,null,{"$f":"IFERROR(INDEX(Прайс!B:B,MATCH(Предложение!B61,Прайс!A:A,0)),\"\")","v":""},{"$f":"IFERROR(INDEX(Прайс!C:C,MATCH(Предложение!B61,Прайс!A:A,0)),\"\")","v":""},null,{"$f":"IFERROR(INDEX(Прайс!D:D,MATCH(Предложение!B61,Прайс!A:A,0))*(100-$F$12)/100,\"\")","v":""},""]
[49,null,{"$f":"IFERROR(INDEX(Прайс!B:B,MATCH(Предложение!B62,Прайс!A:A,0)),\"\")","v":""},{"$f":"IFERROR(INDEX(Прайс!C:C,MATCH(Предложение!B62,Прайс!A:A,0)),\"\")","v":""},null,{"$f":"IFERROR(INDEX(Прайс!D:D,MATCH(Предложение!B62,Прайс!A:A,0))*(100-$F$12)/100,\"\")","v":""},""]
[50,null,{"$f":"IFERROR(INDEX(Прайс!B:B,MATCH(Предложение!B63,Прайс!A:A,0)),\"\")","v":""},{"$f":"IFERROR(INDEX(Прайс!C:C,MATCH(Предложение!B63,Прайс!A:A,0)),\"\")","v":""},null,{"$f":"IFERROR(INDEX(Прайс!D:D,MATCH(Предложение!B63,Прайс!A:A,0))*(100-$F$12)/100,\"\")","v":""},""]
[51,null,{"$f":"IFERROR(INDEX(Прайс!B:B,MATCH(Предложение!B64,Прайс!A:A,0)),\"\")","v":""},{"$f":"IFERROR(INDEX(Прайс!C:C,MATCH(Предложение!B64,Прайс!A:A,0)),\"\")","v":""},null,{"$f":"IFERROR(INDEX(Прайс!D:D,MATCH(Предложение!B64,Прайс!A:A,0))*(100-$F$12)/100,\"\")","v":""},""]
[52,null,{"$f":"IFERROR(INDEX(Прайс!B:B,MATCH(Предложение!B65,Прайс!A:A,0)),\"\")","v":""},{"$f":"IFERROR(INDEX(Прайс!C:C,MATCH(Предложение!B65,Прайс!A:A,0)),\"\")","v":""},null,{"$f":"IFERROR(INDEX(Прайс!D:D,MATCH(Предложение!B65,Прайс!A:A,0))*(100-$F$12)/100,\"\")","v":""},""]
[53,null,{"$f":"IFERROR(INDEX(Прайс!B:B,MATCH(Предложение!B66,Прайс!A:A,0)),\"\")","v":""},{"$f":"IFERROR(INDEX(Прайс!C:C,MATCH(Предложение!B66,Прайс!A:A,0)),\"\")","v":""},null,{"$f":"IFERROR(INDEX(Прайс!D:D,MATCH(Предложение!B66,Прайс!A:A,0))*(100-$F$12)/100,\"\")","v":""},""]
[54,null,{"$f":"IFERROR(INDEX(Прайс!B:B,MATCH(Предложение!B67,Прайс!A:A,0)),\"\")","v":""},{"$f":"IFERROR(INDEX(Прайс!C:C,MATCH(Предложение!B67,Прайс!A:A,0)),\"\")","v":""},null,{"$f":"IFERROR(INDEX(Прайс!D:D,MATCH(Предложение!B67,Прайс!A:A,0))*(100-$F$12)/100,\"\")","v":""},""]
[55,null,{"$f":"IFERROR(INDEX(Прайс!B:B,MATCH(Предложение!B68,Прайс!A:A,0)),\"\")","v":""},{"$f":"IFERROR(INDEX(Прайс!C:C,MATCH(Предложение!B68,Прайс!A:A,0)),\"\")","v":""},null,{"$f":"IFERROR(INDEX(Прайс!D:D,MATCH(Предложение!B68,Прайс!A:A,0))*(100-$F$12)/100,\"\")","v":""},""]
[56,null,{"$f":"IFERROR(INDEX(Прайс!B:B,MATCH(Предложение!B69,Прайс!A:A,0)),\"\")","v":""},{"$f":"IFERROR(INDEX(Прайс!C:C,MATCH(Предложение!B69,Прайс!A:A,0)),\"\")","v":""},null,{"$f":"IFERROR(INDEX(Прайс!D:D,MATCH(Предложение!B69,Прайс!A:A,0))*(100-$F$12)/100,\"\")","v":""},""]
[57,null,{"$f":"IFERROR(INDEX(Прайс!B:B,MATCH(Предложение!B70,Прайс!A:A,0)),\"\")","v":""},{"$f":"IFERROR(INDEX(Прайс!C:C,MATCH(Предложение!B70,Прайс!A:A,0)),\"\")","v":""},null,{"$f":"IFERROR(INDEX(Прайс!D:D,MATCH(Предложение!B70,Прайс!A:A,0))*(100-$F$12)/100,\"\")","v":""},""]
[58,null,{"$f":"IFERROR(INDEX(Прайс!B:B,MATCH(Предложение!B71,Прайс!A:A,0)),\"\")","v":""},{"$f":"IFERROR(INDEX(Прайс!C:C,MATCH(Предложение!B71,Прайс!A:A,0)),\"\")","v":""},null,{"$f":"IFERROR(INDEX(Прайс!D:D,MATCH(Предложение!B71,Прайс!A:A,0))*(100-$F$12)/100,\"\")","v":""},""]
[59,null,{"$f":"IFERROR(INDEX(Прайс!B:B,MATCH(Предложение!B72,Прайс!A:A,0)),\"\")","v":""},{"$f":"IFERROR(INDEX(Прайс!C:C,MATCH(Предложение!B72,Прайс!A:A,0)),\"\")","v":""},null,{"$f":"IFERROR(INDEX(Прайс!D:D,MATCH(Предложение!B72,Прайс!A:A,0))*(100-$F$12)/100,\"\")","v":""},""]
[60,null,{"$f":"IFERROR(INDEX(Прайс!B:B,MATCH(Предложение!B73,Прайс!A:A,0)),\"\")","v":""},{"$f":"IFERROR(INDEX(Прайс!C:C,MATCH(Предложение!B73,Прайс!A:A,0)),\"\")","v":""},null,{"$f":"IFERROR(INDEX(Прайс!D:D,MATCH(Предложение!B73,Прайс!A:A,0))*(100-$F$12)/100,\"\")","v":""},""]
[61,null,{"$f":"IFERROR(INDEX(Прайс!B:B,MATCH(Предложение!B74,Прайс!A:A,0)),\"\")","v":""},{"$f":"IFERROR(INDEX(Прайс!C:C,MATCH(Предложение!B74,Прайс!A:A,0)),\"\")","v":""},null,{"$f":"IFERROR(INDEX(Прайс!D:D,MATCH(Предложение!B74,Прайс!A:A,0))*(100-$F$12)/100,\"\")","v":""},""]
[62,null,{"$f":"IFERROR(INDEX(Прайс!B:B,MATCH(Предложение!B75,Прайс!A:A,0)),\"\")","v":""},{"$f":"IFERROR(INDEX(Прайс!C:C,MATCH(Предложение!B75,Прайс!A:A,0)),\"\")","v":""},null,{"$f":"IFERROR(INDEX(Прайс!D:D,MATCH(Предложение!B75,Прайс!A:A,0))*(100-$F$12)/100,\"\")","v":""},""]
[63,null,{"$f":"IFERROR(INDEX(Прайс!B:B,MATCH(Предложение!B76,Прайс!A:A,0)),\"\")","v":""},{"$f":"IFERROR(INDEX(Прайс!C:C,MATCH(Предложение!B76,Прайс!A:A,0)),\"\")","v":""},null,{"$f":"IFERROR(INDEX(Прайс!D:D,MATCH(Предложение!B76,Прайс!A:A,0))*(100-$F$12)/100,\"\")","v":""},""]
[64,null,{"$f":"IFERROR(INDEX(Прайс!B:B,MATCH(Предложение!B77,Прайс!A:A,0)),\"\")","v":""},{"$f":"IFERROR(INDEX(Прайс!C:C,MATCH(Предложение!B77,Прайс!A:A,0)),\"\")","v":""},null,{"$f":"IFERROR(INDEX(Прайс!D:D,MATCH(Предложение!B77,Прайс!A:A,0))*(100-$F$12)/100,\"\")","v":""},""]
[65,null,{"$f":"IFERROR(INDEX(Прайс!B:B,MATCH(Предложение!B78,Прайс!A:A,0)),\"\")","v":""},{"$f":"IFERROR(INDEX(Прайс!C:C,MATCH(Предложение!B78,Прайс!A:A,0)),\"\")","v":""},null,{"$f":"IFERROR(INDEX(Прайс!D:D,MATCH(Предложение!B78,Прайс!A:A,0))*(100-$F$12)/100,\"\")","v":""},""]
[{"$f":"IF(A78=\"№ п/п\",1,A78+1)","v":66},null,{"$f":"IFERROR(INDEX(Прайс!B:B,MATCH(Предложение!B79,Прайс!A:A,0)),\"\")","v":""},{"$f":"IFERROR(INDEX(Прайс!C:C,MATCH(Предложение!B79,Прайс!A:A,0)),\"\")","v":""},null,{"$f":"IFERROR(INDEX(Прайс!D:D,MATCH(Предложение!B79,Прайс!A:A,0))*(100-$F$12)/100,\"\")","v":""},{"$f":"IFERROR(E79*F79,\"\")","v":""}]
[67,null,{"$f":"IFERROR(INDEX(Прайс!B:B,MATCH(Предложение!B80,Прайс!A:A,0)),\"\")","v":""},{"$f":"IFERROR(INDEX(Прайс!C:C,MATCH(Предложение!B80,Прайс!A:A,0)),\"\")","v":""},null,{"$f":"IFERROR(INDEX(Прайс!D:D,MATCH(Предложение!B80,Прайс!A:A,0))*(100-$F$12)/100,\"\")","v":""},""]
[68,null,{"$f":"IFERROR(INDEX(Прайс!B:B,MATCH(Предложение!B81,Прайс!A:A,0)),\"\")","v":""},{"$f":"IFERROR(INDEX(Прайс!C:C,MATCH(Предложение!B81,Прайс!A:A,0)),\"\")","v":""},null,{"$f":"IFERROR(INDEX(Прайс!D:D,MATCH(Предложение!B81,Прайс!A:A,0))*(100-$F$12)/100,\"\")","v":""},""]
[69,null,{"$f":"IFERROR(INDEX(Прайс!B:B,MATCH(Предложение!B82,Прайс!A:A,0)),\"\")","v":""},{"$f":"IFERROR(INDEX(Прайс!C:C,MATCH(Предложение!B82,Прайс!A:A,0)),\"\")","v":""},null,{"$f":"IFERROR(INDEX(Прайс!D:D,MATCH(Предложение!B82,Прайс!A:A,0))*(100-$F$12)/100,\"\")","v":""},""]
[70,null,{"$f":"IFERROR(INDEX(Прайс!B:B,MATCH(Предложение!B83,Прайс!A:A,0)),\"\")","v":""},{"$f":"IFERROR(INDEX(Прайс!C:C,MATCH(Предложение!B83,Прайс!A:A,0)),\"\")","v":""},null,{"$f":"IFERROR(INDEX(Прайс!D:D,MATCH(Предложение!B83,Прайс!A:A,0))*(100-$F$12)/100,\"\")","v":""},""]
[71,null,{"$f":"IFERROR(INDEX(Прайс!B:B,MATCH(Предложение!B84,Прайс!A:A,0)),\"\")","v":""},{"$f":"IFERROR(INDEX(Прайс!C:C,MATCH(Предложение!B84,Прайс!A:A,0)),\"\")","v":""},null,{"$f":"IFERROR(INDEX(Прайс!D:D,MATCH(Предложение!B84,Прайс!A:A,0))*(100-$F$12)/100,\"\")","v":""},""]
[72,null,{"$f":"IFERROR(INDEX(Прайс!B:B,MATCH(Предложение!B85,Прайс!A:A,0)),\"\")","v":""},{"$f":"IFERROR(INDEX(Прайс!C:C,MATCH(Предложение!B85,Прайс!A:A,0)),\"\")","v":""},null,{"$f":"IFERROR(INDEX(Прайс!D:D,MATCH(Предложение!B85,Прайс!A:A,0))*(100-$F$12)/100,\"\")","v":""},""]
[73,null,{"$f":"IFERROR(INDEX(Прайс!B:B,MATCH(Предложение!B86,Прайс!A:A,0)),\"\")","v":""},{"$f":"IFERROR(INDEX(Прайс!C:C,MATCH(Предложение!B86,Прайс!A:A,0)),\"\")","v":""},null,{"$f":"IFERROR(INDEX(Прайс!D:D,MATCH(Предложение!B86,Прайс!A:A,0))*(100-$F$12)/100,\"\")","v":""},""]
[74,null,{"$f":"IFERROR(INDEX(Прайс!B:B,MATCH(Предложение!B87,Прайс!A:A,0)),\"\")","v":""},{"$f":"IFERROR(INDEX(Прайс!C:C,MATCH(Предложение!B87,Прайс!A:A,0)),\"\")","v":""},null,{"$f":"IFERROR(INDEX(Прайс!D:D,MATCH(Предложение!B87,Прайс!A:A,0))*(100-$F$12)/100,\"\")","v":""},""]
[75,null,{"$f":"IFERROR(INDEX(Прайс!B:B,MATCH(Предложение!B88,Прайс!A:A,0)),\"\")","v":""},{"$f":"IFERROR(INDEX(Прайс!C:C,MATCH(Предложение!B88,Прайс!A:A,0)),\"\")","v":""},null,{"$f":"IFERROR(INDEX(Прайс!D:D,MATCH(Предложение!B88,Прайс!A:A,0))*(100-$F$12)/100,\"\")","v":""},""]
[76,null,{"$f":"IFERROR(INDEX(Прайс!B:B,MATCH(Предложение!B89,Прайс!A:A,0)),\"\")","v":""},{"$f":"IFERROR(INDEX(Прайс!C:C,MATCH(Предложение!B89,Прайс!A:A,0)),\"\")","v":""},null,{"$f":"IFERROR(INDEX(Прайс!D:D,MATCH(Предложение!B89,Прайс!A:A,0))*(100-$F$12)/100,\"\")","v":""},""]
[77,null,{"$f":"IFERROR(INDEX(Прайс!B:B,MATCH(Предложение!B90,Прайс!A:A,0)),\"\")","v":""},{"$f":"IFERROR(INDEX(Прайс!C:C,MATCH(Предложение!B90,Прайс!A:A,0)),\"\")","v":""},null,{"$f":"IFERROR(INDEX(Прайс!D:D,MATCH(Предложение!B90,Прайс!A:A,0))*(100-$F$12)/100,\"\")","v":""},""]
[78,null,{"$f":"IFERROR(INDEX(Прайс!B:B,MATCH(Предложение!B91,Прайс!A:A,0)),\"\")","v":""},{"$f":"IFERROR(INDEX(Прайс!C:C,MATCH(Предложение!B91,Прайс!A:A,0)),\"\")","v":""},null,{"$f":"IFERROR(INDEX(Прайс!D:D,MATCH(Предложение!B91,Прайс!A:A,0))*(100-$F$12)/100,\"\")","v":""},""]
[79,null,{"$f":"IFERROR(INDEX(Прайс!B:B,MATCH(Предложение!B92,Прайс!A:A,0)),\"\")","v":""},{"$f":"IFERROR(INDEX(Прайс!C:C,MATCH(Предложение!B92,Прайс!A:A,0)),\"\")","v":""},null,{"$f":"IFERROR(INDEX(Прайс!D:D,MATCH(Предложение!B92,Прайс!A:A,0))*(100-$F$12)/100,\"\")","v":""},""]
[80,null,{"$f":"IFERROR(INDEX(Прайс!B:B,MATCH(Предложение!B93,Прайс!A:A,0)),\"\")","v":""},{"$f":"IFERROR(INDEX(Прайс!C:C,MATCH(Предложение!B93,Прайс!A:A,0)),\"\")","v":""},null,{"$f":"IFERROR(INDEX(Прайс!D:D,MATCH(Предложение!B93,Прайс!A:A,0))*(100-$F$12)/100,\"\")","v":""},""]
[81,null,{"$f":"IFERROR(INDEX(Прайс!B:B,MATCH(Предложение!B94,Прайс!A:A,0)),\"\")","v":""},{"$f":"IFERROR(INDEX(Прайс!C:C,MATCH(Предложение!B94,Прайс!A:A,0)),\"\")","v":""},null,{"$f":"IFERROR(INDEX(Прайс!D:D,MATCH(Предложение!B94,Прайс!A:A,0))*(100-$F$12)/100,\"\")","v":""},""]
[82,null,{"$f":"IFERROR(INDEX(Прайс!B:B,MATCH(Предложение!B95,Прайс!A:A,0)),\"\")","v":""},{"$f":"IFERROR(INDEX(Прайс!C:C,MATCH(Предложение!B95,Прайс!A:A,0)),\"\")","v":""},null,{"$f":"IFERROR(INDEX(Прайс!D:D,MATCH(Предложение!B95,Прайс!A:A,0))*(100-$F$12)/100,\"\")","v":""},""]
[83,null,{"$f":"IFERROR(INDEX(Прайс!B:B,MATCH(Предложение!B96,Прайс!A:A,0)),\"\")","v":""},{"$f":"IFERROR(INDEX(Прайс!C:C,MATCH(Предложение!B96,Прайс!A:A,0)),\"\")","v":""},null,{"$f":"IFERROR(INDEX(Прайс!D:D,MATCH(Предложение!B96,Прайс!A:A,0))*(100-$F$12)/100,\"\")","v":""},""]
[84,null,{"$f":"IFERROR(INDEX(Прайс!B:B,MATCH(Предложение!B97,Прайс!A:A,0)),\"\")","v":""},{"$f":"IFERROR(INDEX(Прайс!C:C,MATCH(Предложение!B97,Прайс!A:A,0)),\"\")","v":""},null,{"$f":"IFERROR(INDEX(Прайс!D:D,MATCH(Предложение!B97,Прайс!A:A,0))*(100-$F$12)/100,\"\")","v":""},""]
[85,null,{"$f":"IFERROR(INDEX(Прайс!B:B,MATCH(Предложение!B98,Прайс!A:A,0)),\"\")","v":""},{"$f":"IFERROR(INDEX(Прайс!C:C,MATCH(Предложение!B98,Прайс!A:A,0)),\"\")","v":""},null,{"$f":"IFERROR(INDEX(Прайс!D:D,MATCH(Предложение!B98,Прайс!A:A,0))*(100-$F$12)/100,\"\")","v":""},""]
[86,null,{"$f":"IFERROR(INDEX(Прайс!B:B,MATCH(Предложение!B99,Прайс!A:A,0)),\"\")","v":""},{"$f":"IFERROR(INDEX(Прайс!C:C,MATCH(Предложение!B99,Прайс!A:A,0)),\"\")","v":""},null,{"$f":"IFERROR(INDEX(Прайс!D:D,MATCH(Предложение!B99,Прайс!A:A,0))*(100-$F$12)/100,\"\")","v":""},""]
[87,null,{"$f":"IFERROR(INDEX(Прайс!B:B,MATCH(Предложение!B100,Прайс!A:A,0)),\"\")","v":""},{"$f":"IFERROR(INDEX(Прайс!C:C,MATCH(Предложение!B100,Прайс!A:A,0)),\"\")","v":""},null,{"$f":"IFERROR(INDEX(Прайс!D:D,MATCH(Предложение!B100,Прайс!A:A,0))*(100-$F$12)/100,\"\")","v":""},""]
[88,null,{"$f":"IFERROR(INDEX(Прайс!B:B,MATCH(Предложение!B101,Прайс!A:A,0)),\"\")","v":""},{"$f":"IFERROR(INDEX(Прайс!C:C,MATCH(Предложение!B101,Прайс!A:A,0)),\"\")","v":""},null,{"$f":"IFERROR(INDEX(Прайс!D:D,MATCH(Предложение!B101,Прайс!A:A,0))*(100-$F$12)/100,\"\")","v":""},""]
[89,null,{"$f":"IFERROR(INDEX(Прайс!B:B,MATCH(Предложение!B102,Прайс!A:A,0)),\"\")","v":""},{"$f":"IFERROR(INDEX(Прайс!C:C,MATCH(Предложение!B102,Прайс!A:A,0)),\"\")","v":""},null,{"$f":"IFERROR(INDEX(Прайс!D:D,MATCH(Предложение!B102,Прайс!A:A,0))*(100-$F$12)/100,\"\")","v":""},""]
[90,null,{"$f":"IFERROR(INDEX(Прайс!B:B,MATCH(Предложение!B103,Прайс!A:A,0)),\"\")","v":""},{"$f":"IFERROR(INDEX(Прайс!C:C,MATCH(Предложение!B103,Прайс!A:A,0)),\"\")","v":""},null,{"$f":"IFERROR(INDEX(Прайс!D:D,MATCH(Предложение!B103,Прайс!A:A,0))*(100-$F$12)/100,\"\")","v":""},""]
[91,null,{"$f":"IFERROR(INDEX(Прайс!B:B,MATCH(Предложение!B104,Прайс!A:A,0)),\"\")","v":""},{"$f":"IFERROR(INDEX(Прайс!C:C,MATCH(Предложение!B104,Прайс!A:A,0)),\"\")","v":""},null,{"$f":"IFERROR(INDEX(Прайс!D:D,MATCH(Предложение!B104,Прайс!A:A,0))*(100-$F$12)/100,\"\")","v":""},""]
[92,null,{"$f":"IFERROR(INDEX(Прайс!B:B,MATCH(Предложение!B105,Прайс!A:A,0)),\"\")","v":""},{"$f":"IFERROR(INDEX(Прайс!C:C,MATCH(Предложение!B105,Прайс!A:A,0)),\"\")","v":""},null,{"$f":"IFERROR(INDEX(Прайс!D:D,MATCH(Предложение!B105,Прайс!A:A,0))*(100-$F$12)/100,\"\")","v":""},""]
[93,null,{"$f":"IFERROR(INDEX(Прайс!B:B,MATCH(Предложение!B106,Прайс!A:A,0)),\"\")","v":""},{"$f":"IFERROR(INDEX(Прайс!C:C,MATCH(Предложение!B106,Прайс!A:A,0)),\"\")","v":""},null,{"$f":"IFERROR(INDEX(Прайс!D:D,MATCH(Предложение!B106,Прайс!A:A,0))*(100-$F$12)/100,\"\")","v":""},""]
[94,null,{"$f":"IFERROR(INDEX(Прайс!B:B,MATCH(Предложение!B107,Прайс!A:A,0)),\"\")","v":""},{"$f":"IFERROR(INDEX(Прайс!C:C,MATCH(Предложение!B107,Прайс!A:A,0)),\"\")","v":""},null,{"$f":"IFERROR(INDEX(Прайс!D:D,MATCH(Предложение!B107,Прайс!A:A,0))*(100-$F$12)/100,\"\")","v":""},""]
[95,null,{"$f":"IFERROR(INDEX(Прайс!B:B,MATCH(Предложение!B108,Прайс!A:A,0)),\"\")","v":""},{"$f":"IFERROR(INDEX(Прайс!C:C,MATCH(Предложение!B108,Прайс!A:A,0)),\"\")","v":""},null,{"$f":"IFERROR(INDEX(Прайс!D:D,MATCH(Предложение!B108,Прайс!A:A,0))*(100-$F$12)/100,\"\")","v":""},""]
[96,null,{"$f":"IFERROR(INDEX(Прайс!B:B,MATCH(Предложение!B109,Прайс!A:A,0)),\"\")","v":""},{"$f":"IFERROR(INDEX(Прайс!C:C,MATCH(Предложение!B109,Прайс!A:A,0)),\"\")","v":""},null,{"$f":"IFERROR(INDEX(Прайс!D:D,MATCH(Предложение!B109,Прайс!A:A,0))*(100-$F$12)/100,\"\")","v":""},""]
[97,null,{"$f":"IFERROR(INDEX(Прайс!B:B,MATCH(Предложение!B110,Прайс!A:A,0)),\"\")","v":""},{"$f":"IFERROR(INDEX(Прайс!C:C,MATCH(Предложение!B110,Прайс!A:A,0)),\"\")","v":""},null,{"$f":"IFERROR(INDEX(Прайс!D:D,MATCH(Предложение!B110,Прайс!A:A,0))*(100-$F$12)/100,\"\")","v":""},""]
[98,null,{"$f":"IFERROR(INDEX(Прайс!B:B,MATCH(Предложение!B111,Прайс!A:A,0)),\"\")","v":""},{"$f":"IFERROR(INDEX(Прайс!C:C,MATCH(Предложение!B111,Прайс!A:A,0)),\"\")","v":""},null,{"$f":"IFERROR(INDEX(Прайс!D:D,MATCH(Предложение!B111,Прайс!A:A,0))*(100-$F$12)/100,\"\")","v":""},""]
[99,null,{"$f":"IFERROR(INDEX(Прайс!B:B,MATCH(Предложение!B112,Прайс!A:A,0)),\"\")","v":""},{"$f":"IFERROR(INDEX(Прайс!C:C,MATCH(Предложение!B112,Прайс!A:A,0)),\"\")","v":""},null,{"$f":"IFERROR(INDEX(Прайс!D:D,MATCH(Предложение!B112,Прайс!A:A,0))*(100-$F$12)/100,\"\")","v":""},""]
[100,null,{"$f":"IFERROR(INDEX(Прайс!B:B,MATCH(Предложение!B113,Прайс!A:A,0)),\"\")","v":""},{"$f":"IFERROR(INDEX(Прайс!C:C,MATCH(Предложение!B113,Прайс!A:A,0)),\"\")","v":""},null,{"$f":"IFERROR(INDEX(Прайс!D:D,MATCH(Предложение!B113,Прайс!A:A,0))*(100-$F$12)/100,\"\")","v":""},""]
[101,null,{"$f":"IFERROR(INDEX(Прайс!B:B,MATCH(Предложение!B114,Прайс!A:A,0)),\"\")","v":""},{"$f":"IFERROR(INDEX(Прайс!C:C,MATCH(Предложение!B114,Прайс!A:A,0)),\"\")","v":""},null,{"$f":"IFERROR(INDEX(Прайс!D:D,MATCH(Предложение!B114,Прайс!A:A,0))*(100-$F$12)/100,\"\")","v":""},""]
[102,null,{"$f":"IFERROR(INDEX(Прайс!B:B,MATCH(Предложение!B115,Прайс!A:A,0)),\"\")","v":""},{"$f":"IFERROR(INDEX(Прайс!C:C,MATCH(Предложение!B115,Прайс!A:A,0)),\"\")","v":""},null,{"$f":"IFERROR(INDEX(Прайс!D:D,MATCH(Предложение!B115,Прайс!A:A,0))*(100-$F$12)/100,\"\")","v":""},""]
[103,null,{"$f":"IFERROR(INDEX(Прайс!B:B,MATCH(Предложение!B116,Прайс!A:A,0)),\"\")","v":""},{"$f":"IFERROR(INDEX(Прайс!C:C,MATCH(Предложение!B116,Прайс!A:A,0)),\"\")","v":""},null,{"$f":"IFERROR(INDEX(Прайс!D:D,MATCH(Предложение!B116,Прайс!A:A,0))*(100-$F$12)/100,\"\")","v":""},""]
[104,null,{"$f":"IFERROR(INDEX(Прайс!B:B,MATCH(Предложение!B117,Прайс!A:A,0)),\"\")","v":""},{"$f":"IFERROR(INDEX(Прайс!C:C,MATCH(Предложение!B117,Прайс!A:A,0)),\"\")","v":""},null,{"$f":"IFERROR(INDEX(Прайс!D:D,MATCH(Предложение!B117,Прайс!A:A,0))*(100-$F$12)/100,\"\")","v":""},""]
[105,null,{"$f":"IFERROR(INDEX(Прайс!B:B,MATCH(Предложение!B118,Прайс!A:A,0)),\"\")","v":""},{"$f":"IFERROR(INDEX(Прайс!C:C,MATCH(Предложение!B118,Прайс!A:A,0)),\"\")","v":""},null,{"$f":"IFERROR(INDEX(Прайс!D:D,MATCH(Предложение!B118,Прайс!A:A,0))*(100-$F$12)/100,\"\")","v":""},""]
[106,null,{"$f":"IFERROR(INDEX(Прайс!B:B,MATCH(Предложение!B119,Прайс!A:A,0)),\"\")","v":""},{"$f":"IFERROR(INDEX(Прайс!C:C,MATCH(Предложение!B119,Прайс!A:A,0)),\"\")","v":""},null,{"$f":"IFERROR(INDEX(Прайс!D:D,MATCH(Предложение!B119,Прайс!A:A,0))*(100-$F$12)/100,\"\")","v":""},""]
[107,null,{"$f":"IFERROR(INDEX(Прайс!B:B,MATCH(Предложение!B120,Прайс!A:A,0)),\"\")","v":""},{"$f":"IFERROR(INDEX(Прайс!C:C,MATCH(Предложение!B120,Прайс!A:A,0)),\"\")","v":""},null,{"$f":"IFERROR(INDEX(Прайс!D:D,MATCH(Предложение!B120,Прайс!A:A,0))*(100-$F$12)/100,\"\")","v":""},""]
[108,null,{"$f":"IFERROR(INDEX(Прайс!B:B,MATCH(Предложение!B121,Прайс!A:A,0)),\"\")","v":""},{"$f":"IFERROR(INDEX(Прайс!C:C,MATCH(Предложение!B121,Прайс!A:A,0)),\"\")","v":""},null,{"$f":"IFERROR(INDEX(Прайс!D:D,MATCH(Предложение!B121,Прайс!A:A,0))*(100-$F$12)/100,\"\")","v":""},""]
[109,null,{"$f":"IFERROR(INDEX(Прайс!B:B,MATCH(Предложение!B122,Прайс!A:A,0)),\"\")","v":""},{"$f":"IFERROR(INDEX(Прайс!C:C,MATCH(Предложение!B122,Прайс!A:A,0)),\"\")","v":""},null,{"$f":"IFERROR(INDEX(Прайс!D:D,MATCH(Предложение!B122,Прайс!A:A,0))*(100-$F$12)/100,\"\")","v":""},""]
[110,null,{"$f":"IFERROR(INDEX(Прайс!B:B,MATCH(Предложение!B123,Прайс!A:A,0)),\"\")","v":""},{"$f":"IFERROR(INDEX(Прайс!C:C,MATCH(Предложение!B123,Прайс!A:A,0)),\"\")","v":""},null,{"$f":"IFERROR(INDEX(Прайс!D:D,MATCH(Предложение!B123,Прайс!A:A,0))*(100-$F$12)/100,\"\")","v":""},""]
[111,null,{"$f":"IFERROR(INDEX(Прайс!B:B,MATCH(Предложение!B124,Прайс!A:A,0)),\"\")","v":""},{"$f":"IFERROR(INDEX(Прайс!C:C,MATCH(Предложение!B124,Прайс!A:A,0)),\"\")","v":""},null,{"$f":"IFERROR(INDEX(Прайс!D:D,MATCH(Предложение!B124,Прайс!A:A,0))*(100-$F$12)/100,\"\")","v":""},""]
[112,null,{"$f":"IFERROR(INDEX(Прайс!B:B,MATCH(Предложение!B125,Прайс!A:A,0)),\"\")","v":""},{"$f":"IFERROR(INDEX(Прайс!C:C,MATCH(Предложение!B125,Прайс!A:A,0)),\"\")","v":""},null,{"$f":"IFERROR(INDEX(Прайс!D:D,MATCH(Предложение!B125,Прайс!A:A,0))*(100-$F$12)/100,\"\")","v":""},""]
[113,null,{"$f":"IFERROR(INDEX(Прайс!B:B,MATCH(Предложение!B126,Прайс!A:A,0)),\"\")","v":""},{"$f":"IFERROR(INDEX(Прайс!C:C,MATCH(Предложение!B126,Прайс!A:A,0)),\"\")","v":""},null,{"$f":"IFERROR(INDEX(Прайс!D:D,MATCH(Предложение!B126,Прайс!A:A,0))*(100-$F$12)/100,\"\")","v":""},""]
[114,null,{"$f":"IFERROR(INDEX(Прайс!B:B,MATCH(Предложение!B127,Прайс!A:A,0)),\"\")","v":""},{"$f":"IFERROR(INDEX(Прайс!C:C,MATCH(Предложение!B127,Прайс!A:A,0)),\"\")","v":""},null,{"$f":"IFERROR(INDEX(Прайс!D:D,MATCH(Предложение!B127,Прайс!A:A,0))*(100-$F$12)/100,\"\")","v":""},""]
[115,null,{"$f":"IFERROR(INDEX(Прайс!B:B,MATCH(Предложение!B128,Прайс!A:A,0)),\"\")","v":""},{"$f":"IFERROR(INDEX(Прайс!C:C,MATCH(Предложение!B128,Прайс!A:A,0)),\"\")","v":""},null,{"$f":"IFERROR(INDEX(Прайс!D:D,MATCH(Предложение!B128,Прайс!A:A,0))*(100-$F$12)/100,\"\")","v":""},""]
[116,null,{"$f":"IFERROR(INDEX(Прайс!B:B,MATCH(Предложение!B129,Прайс!A:A,0)),\"\")","v":""},{"$f":"IFERROR(INDEX(Прайс!C:C,MATCH(Предложение!B129,Прайс!A:A,0)),\"\")","v":""},null,{"$f":"IFERROR(INDEX(Прайс!D:D,MATCH(Предложение!B129,Прайс!A:A,0))*(100-$F$12)/100,\"\")","v":""},""]
[117,null,{"$f":"IFERROR(INDEX(Прайс!B:B,MATCH(Предложение!B130,Прайс!A:A,0)),\"\")","v":""},{"$f":"IFERROR(INDEX(Прайс!C:C,MATCH(Предложение!B130,Прайс!A:A,0)),\"\")","v":""},null,{"$f":"IFERROR(INDEX(Прайс!D:D,MATCH(Предложение!B130,Прайс!A:A,0))*(100-$F$12)/100,\"\")","v":""},""]
[118,null,{"$f":"IFERROR(INDEX(Прайс!B:B,MATCH(Предложение!B131,Прайс!A:A,0)),\"\")","v":""},{"$f":"IFERROR(INDEX(Прайс!C:C,MATCH(Предложение!B131,Прайс!A:A,0)),\"\")","v":""},null,{"$f":"IFERROR(INDEX(Прайс!D:D,MATCH(Предложение!B131,Прайс!A:A,0))*(100-$F$12)/100,\"\")","v":""},""]
[119,null,{"$f":"IFERROR(INDEX(Прайс!B:B,MATCH(Предложение!B132,Прайс!A:A,0)),\"\")","v":""},{"$f":"IFERROR(INDEX(Прайс!C:C,MATCH(Предложение!B132,Прайс!A:A,0)),\"\")","v":""},null,{"$f":"IFERROR(INDEX(Прайс!D:D,MATCH(Предложение!B132,Прайс!A:A,0))*(100-$F$12)/100,\"\")","v":""},""]
[120,null,{"$f":"IFERROR(INDEX(Прайс!B:B,MATCH(Предложение!B133,Прайс!A:A,0)),\"\")","v":""},{"$f":"IFERROR(INDEX(Прайс!C:C,MATCH(Предложение!B133,Прайс!A:A,0)),\"\")","v":""},null,{"$f":"IFERROR(INDEX(Прайс!D:D,MATCH(Предложение!B133,Прайс!A:A,0))*(100-$F$12)/100,\"\")","v":""},""]
[121,null,{"$f":"IFERROR(INDEX(Прайс!B:B,MATCH(Предложение!B134,Прайс!A:A,0)),\"\")","v":""},{"$f":"IFERROR(INDEX(Прайс!C:C,MATCH(Предложение!B134,Прайс!A:A,0)),\"\")","v":""},null,{"$f":"IFERROR(INDEX(Прайс!D:D,MATCH(Предложение!B134,Прайс!A:A,0))*(100-$F$12)/100,\"\")","v":""},""]
[122,null,{"$f":"IFERROR(INDEX(Прайс!B:B,MATCH(Предложение!B135,Прайс!A:A,0)),\"\")","v":""},{"$f":"IFERROR(INDEX(Прайс!C:C,MATCH(Предложение!B135,Прайс!A:A,0)),\"\")","v":""},null,{"$f":"IFERROR(INDEX(Прайс!D:D,MATCH(Предложение!B135,Прайс!A:A,0))*(100-$F$12)/100,\"\")","v":""},""]
[123,null,{"$f":"IFERROR(INDEX(Прайс!B:B,MATCH(Предложение!B136,Прайс!A:A,0)),\"\")","v":""},{"$f":"IFERROR(INDEX(Прайс!C:C,MATCH(Предложение!B136,Прайс!A:A,0)),\"\")","v":""},null,{"$f":"IFERROR(INDEX(Прайс!D:D,MATCH(Предложение!B136,Прайс!A:A,0))*(100-$F$12)/100,\"\")","v":""},""]
[124,null,{"$f":"IFERROR(INDEX(Прайс!B:B,MATCH(Предложение!B137,Прайс!A:A,0)),\"\")","v":""},{"$f":"IFERROR(INDEX(Прайс!C:C,MATCH(Предложение!B137,Прайс!A:A,0)),\"\")","v":""},null,{"$f":"IFERROR(INDEX(Прайс!D:D,MATCH(Предложение!B137,Прайс!A:A,0))*(100-$F$12)/100,\"\")","v":""},""]
[125,null,{"$f":"IFERROR(INDEX(Прайс!B:B,MATCH(Предложение!B138,Прайс!A:A,0)),\"\")","v":""},{"$f":"IFERROR(INDEX(Прайс!C:C,MATCH(Предложение!B138,Прайс!A:A,0)),\"\")","v":""},null,{"$f":"IFERROR(INDEX(Прайс!D:D,MATCH(Предложение!B138,Прайс!A:A,0))*(100-$F$12)/100,\"\")","v":""},""]
[126,null,{"$f":"IFERROR(INDEX(Прайс!B:B,MATCH(Предложение!B139,Прайс!A:A,0)),\"\")","v":""},{"$f":"IFERROR(INDEX(Прайс!C:C,MATCH(Предложение!B139,Прайс!A:A,0)),\"\")","v":""},null,{"$f":"IFERROR(INDEX(Прайс!D:D,MATCH(Предложение!B139,Прайс!A:A,0))*(100-$F$12)/100,\"\")","v":""},""]
[127,null,{"$f":"IFERROR(INDEX(Прайс!B:B,MATCH(Предложение!B140,Прайс!A:A,0)),\"\")","v":""},{"$f":"IFERROR(INDEX(Прайс!C:C,MATCH(Предложение!B140,Прайс!A:A,0)),\"\")","v":""},null,{"$f":"IFERROR(INDEX(Прайс!D:D,MATCH(Предложение!B140,Прайс!A:A,0))*(100-$F$12)/100,\"\")","v":""},""]
[128,null,{"$f":"IFERROR(INDEX(Прайс!B:B,MATCH(Предложение!B141,Прайс!A:A,0)),\"\")","v":""},{"$f":"IFERROR(INDEX(Прайс!C:C,MATCH(Предложение!B141,Прайс!A:A,0)),\"\")","v":""},null,{"$f":"IFERROR(INDEX(Прайс!D:D,MATCH(Предложение!B141,Прайс!A:A,0))*(100-$F$12)/100,\"\")","v":""},""]
[129,null,{"$f":"IFERROR(INDEX(Прайс!B:B,MATCH(Предложение!B142,Прайс!A:A,0)),\"\")","v":""},{"$f":"IFERROR(INDEX(Прайс!C:C,MATCH(Предложение!B142,Прайс!A:A,0)),\"\")","v":""},null,{"$f":"IFERROR(INDEX(Прайс!D:D,MATCH(Предложение!B142,Прайс!A:A,0))*(100-$F$12)/100,\"\")","v":""},""]
[{"$f":"IF(A142=\"№ п/п\",1,A142+1)","v":130},null,{"$f":"IFERROR(INDEX(Прайс!B:B,MATCH(Предложение!B143,Прайс!A:A,0)),\"\")","v":""},{"$f":"IFERROR(INDEX(Прайс!C:C,MATCH(Предложение!B143,Прайс!A:A,0)),\"\")","v":""},null,{"$f":"IFERROR(INDEX(Прайс!D:D,MATCH(Предложение!B143,Прайс!A:A,0))*(100-$F$12)/100,\"\")","v":""},{"$f":"IFERROR(E143*F143,\"\")","v":""}]
[131,null,{"$f":"IFERROR(INDEX(Прайс!B:B,MATCH(Предложение!B144,Прайс!A:A,0)),\"\")","v":""},{"$f":"IFERROR(INDEX(Прайс!C:C,MATCH(Предложение!B144,Прайс!A:A,0)),\"\")","v":""},null,{"$f":"IFERROR(INDEX(Прайс!D:D,MATCH(Предложение!B144,Прайс!A:A,0))*(100-$F$12)/100,\"\")","v":""},""]
[132,null,{"$f":"IFERROR(INDEX(Прайс!B:B,MATCH(Предложение!B145,Прайс!A:A,0)),\"\")","v":""},{"$f":"IFERROR(INDEX(Прайс!C:C,MATCH(Предложение!B145,Прайс!A:A,0)),\"\")","v":""},null,{"$f":"IFERROR(INDEX(Прайс!D:D,MATCH(Предложение!B145,Прайс!A:A,0))*(100-$F$12)/100,\"\")","v":""},""]
[133,null,{"$f":"IFERROR(INDEX(Прайс!B:B,MATCH(Предложение!B146,Прайс!A:A,0)),\"\")","v":""},{"$f":"IFERROR(INDEX(Прайс!C:C,MATCH(Предложение!B146,Прайс!A:A,0)),\"\")","v":""},null,{"$f":"IFERROR(INDEX(Прайс!D:D,MATCH(Предложение!B146,Прайс!A:A,0))*(100-$F$12)/100,\"\")","v":""},""]
[134,null,{"$f":"IFERROR(INDEX(Прайс!B:B,MATCH(Предложение!B147,Прайс!A:A,0)),\"\")","v":""},{"$f":"IFERROR(INDEX(Прайс!C:C,MATCH(Предложение!B147,Прайс!A:A,0)),\"\")","v":""},null,{"$f":"IFERROR(INDEX(Прайс!D:D,MATCH(Предложение!B147,Прайс!A:A,0))*(100-$F$12)/100,\"\")","v":""},""]
[135,null,{"$f":"IFERROR(INDEX(Прайс!B:B,MATCH(Предложение!B148,Прайс!A:A,0)),\"\")","v":""},{"$f":"IFERROR(INDEX(Прайс!C:C,MATCH(Предложение!B148,Прайс!A:A,0)),\"\")","v":""},null,{"$f":"IFERROR(INDEX(Прайс!D:D,MATCH(Предложение!B148,Прайс!A:A,0))*(100-$F$12)/100,\"\")","v":""},""]
[136,null,{"$f":"IFERROR(INDEX(Прайс!B:B,MATCH(Предложение!B149,Прайс!A:A,0)),\"\")","v":""},{"$f":"IFERROR(INDEX(Прайс!C:C,MATCH(Предложение!B149,Прайс!A:A,0)),\"\")","v":""},null,{"$f":"IFERROR(INDEX(Прайс!D:D,MATCH(Предложение!B149,Прайс!A:A,0))*(100-$F$12)/100,\"\")","v":""},""]
[137,null,{"$f":"IFERROR(INDEX(Прайс!B:B,MATCH(Предложение!B150,Прайс!A:A,0)),\"\")","v":""},{"$f":"IFERROR(INDEX(Прайс!C:C,MATCH(Предложение!B150,Прайс!A:A,0)),\"\")","v":""},null,{"$f":"IFERROR(INDEX(Прайс!D:D,MATCH(Предложение!B150,Прайс!A:A,0))*(100-$F$12)/100,\"\")","v":""},""]
[138,null,{"$f":"IFERROR(INDEX(Прайс!B:B,MATCH(Предложение!B151,Прайс!A:A,0)),\"\")","v":""},{"$f":"IFERROR(INDEX(Прайс!C:C,MATCH(Предложение!B151,Прайс!A:A,0)),\"\")","v":""},null,{"$f":"IFERROR(INDEX(Прайс!D:D,MATCH(Предложение!B151,Прайс!A:A,0))*(100-$F$12)/100,\"\")","v":""},""]
[139,null,{"$f":"IFERROR(INDEX(Прайс!B:B,MATCH(Предложение!B152,Прайс!A:A,0)),\"\")","v":""},{"$f":"IFERROR(INDEX(Прайс!C:C,MATCH(Предложение!B152,Прайс!A:A,0)),\"\")","v":""},null,{"$f":"IFERROR(INDEX(Прайс!D:D,MATCH(Предложение!B152,Прайс!A:A,0))*(100-$F$12)/100,\"\")","v":""},""]
[140,null,{"$f":"IFERROR(INDEX(Прайс!B:B,MATCH(Предложение!B153,Прайс!A:A,0)),\"\")","v":""},{"$f":"IFERROR(INDEX(Прайс!C:C,MATCH(Предложение!B153,Прайс!A:A,0)),\"\")","v":""},null,{"$f":"IFERROR(INDEX(Прайс!D:D,MATCH(Предложение!B153,Прайс!A:A,0))*(100-$F$12)/100,\"\")","v":""},""]
[141,null,{"$f":"IFERROR(INDEX(Прайс!B:B,MATCH(Предложение!B154,Прайс!A:A,0)),\"\")","v":""},{"$f":"IFERROR(INDEX(Прайс!C:C,MATCH(Предложение!B154,Прайс!A:A,0)),\"\")","v":""},null,{"$f":"IFERROR(INDEX(Прайс!D:D,MATCH(Предложение!B154,Прайс!A:A,0))*(100-$F$12)/100,\"\")","v":""},""]
[142,null,{"$f":"IFERROR(INDEX(Прайс!B:B,MATCH(Предложение!B155,Прайс!A:A,0)),\"\")","v":""},{"$f":"IFERROR(INDEX(Прайс!C:C,MATCH(Предложение!B155,Прайс!A:A,0)),\"\")","v":""},null,{"$f":"IFERROR(INDEX(Прайс!D:D,MATCH(Предложение!B155,Прайс!A:A,0))*(100-$F$12)/100,\"\")","v":""},""]
[143,null,{"$f":"IFERROR(INDEX(Прайс!B:B,MATCH(Предложение!B156,Прайс!A:A,0)),\"\")","v":""},{"$f":"IFERROR(INDEX(Прайс!C:C,MATCH(Предложение!B156,Прайс!A:A,0)),\"\")","v":""},null,{"$f":"IFERROR(INDEX(Прайс!D:D,MATCH(Предложение!B156,Прайс!A:A,0))*(100-$F$12)/100,\"\")","v":""},""]
[144,null,{"$f":"IFERROR(INDEX(Прайс!B:B,MATCH(Предложение!B157,Прайс!A:A,0)),\"\")","v":""},{"$f":"IFERROR(INDEX(Прайс!C:C,MATCH(Предложение!B157,Прайс!A:A,0)),\"\")","v":""},null,{"$f":"IFERROR(INDEX(Прайс!D:D,MATCH(Предложение!B157,Прайс!A:A,0))*(100-$F$12)/100,\"\")","v":""},""]
[145,null,{"$f":"IFERROR(INDEX(Прайс!B:B,MATCH(Предложение!B158,Прайс!A:A,0)),\"\")","v":""},{"$f":"IFERROR(INDEX(Прайс!C:C,MATCH(Предложение!B158,Прайс!A:A,0)),\"\")","v":""},null,{"$f":"IFERROR(INDEX(Прайс!D:D,MATCH(Предложение!B158,Прайс!A:A,0))*(100-$F$12)/100,\"\")","v":""},""]
[146,null,{"$f":"IFERROR(INDEX(Прайс!B:B,MATCH(Предложение!B159,Прайс!A:A,0)),\"\")","v":""},{"$f":"IFERROR(INDEX(Прайс!C:C,MATCH(Предложение!B159,Прайс!A:A,0)),\"\")","v":""},null,{"$f":"IFERROR(INDEX(Прайс!D:D,MATCH(Предложение!B159,Прайс!A:A,0))*(100-$F$12)/100,\"\")","v":""},""]
[147,null,{"$f":"IFERROR(INDEX(Прайс!B:B,MATCH(Предложение!B160,Прайс!A:A,0)),\"\")","v":""},{"$f":"IFERROR(INDEX(Прайс!C:C,MATCH(Предложение!B160,Прайс!A:A,0)),\"\")","v":""},null,{"$f":"IFERROR(INDEX(Прайс!D:D,MATCH(Предложение!B160,Прайс!A:A,0))*(100-$F$12)/100,\"\")","v":""},""]
[148,null,{"$f":"IFERROR(INDEX(Прайс!B:B,MATCH(Предложение!B161,Прайс!A:A,0)),\"\")","v":""},{"$f":"IFERROR(INDEX(Прайс!C:C,MATCH(Предложение!B161,Прайс!A:A,0)),\"\")","v":""},null,{"$f":"IFERROR(INDEX(Прайс!D:D,MATCH(Предложение!B161,Прайс!A:A,0))*(100-$F$12)/100,\"\")","v":""},""]
[149,null,{"$f":"IFERROR(INDEX(Прайс!B:B,MATCH(Предложение!B162,Прайс!A:A,0)),\"\")","v":""},{"$f":"IFERROR(INDEX(Прайс!C:C,MATCH(Предложение!B162,Прайс!A:A,0)),\"\")","v":""},null,{"$f":"IFERROR(INDEX(Прайс!D:D,MATCH(Предложение!B162,Прайс!A:A,0))*(100-$F$12)/100,\"\")","v":""},""]
[150,null,{"$f":"IFERROR(INDEX(Прайс!B:B,MATCH(Предложение!B163,Прайс!A:A,0)),\"\")","v":""},{"$f":"IFERROR(INDEX(Прайс!C:C,MATCH(Предложение!B163,Прайс!A:A,0)),\"\")","v":""},null,{"$f":"IFERROR(INDEX(Прайс!D:D,MATCH(Предложение!B163,Прайс!A:A,0))*(100-$F$12)/100,\"\")","v":""},""]
[151,null,{"$f":"IFERROR(INDEX(Прайс!B:B,MATCH(Предложение!B164,Прайс!A:A,0)),\"\")","v":""},{"$f":"IFERROR(INDEX(Прайс!C:C,MATCH(Предложение!B164,Прайс!A:A,0)),\"\")","v":""},null,{"$f":"IFERROR(INDEX(Прайс!D:D,MATCH(Предложение!B164,Прайс!A:A,0))*(100-$F$12)/100,\"\")","v":""},""]
[152,null,{"$f":"IFERROR(INDEX(Прайс!B:B,MATCH(Предложение!B165,Прайс!A:A,0)),\"\")","v":""},{"$f":"IFERROR(INDEX(Прайс!C:C,MATCH(Предложение!B165,Прайс!A:A,0)),\"\")","v":""},null,{"$f":"IFERROR(INDEX(Прайс!D:D,MATCH(Предложение!B165,Прайс!A:A,0))*(100-$F$12)/100,\"\")","v":""},""]
[153,null,{"$f":"IFERROR(INDEX(Прайс!B:B,MATCH(Предложение!B166,Прайс!A:A,0)),\"\")","v":""},{"$f":"IFERROR(INDEX(Прайс!C:C,MATCH(Предложение!B166,Прайс!A:A,0)),\"\")","v":""},null,{"$f":"IFERROR(INDEX(Прайс!D:D,MATCH(Предложение!B166,Прайс!A:A,0))*(100-$F$12)/100,\"\")","v":""},""]
[154,null,{"$f":"IFERROR(INDEX(Прайс!B:B,MATCH(Предложение!B167,Прайс!A:A,0)),\"\")","v":""},{"$f":"IFERROR(INDEX(Прайс!C:C,MATCH(Предложение!B167,Прайс!A:A,0)),\"\")","v":""},null,{"$f":"IFERROR(INDEX(Прайс!D:D,MATCH(Предложение!B167,Прайс!A:A,0))*(100-$F$12)/100,\"\")","v":""},""]
[155,null,{"$f":"IFERROR(INDEX(Прайс!B:B,MATCH(Предложение!B168,Прайс!A:A,0)),\"\")","v":""},{"$f":"IFERROR(INDEX(Прайс!C:C,MATCH(Предложение!B168,Прайс!A:A,0)),\"\")","v":""},null,{"$f":"IFERROR(INDEX(Прайс!D:D,MATCH(Предложение!B168,Прайс!A:A,0))*(100-$F$12)/100,\"\")","v":""},""]
[156,null,{"$f":"IFERROR(INDEX(Прайс!B:B,MATCH(Предложение!B169,Прайс!A:A,0)),\"\")","v":""},{"$f":"IFERROR(INDEX(Прайс!C:C,MATCH(Предложение!B169,Прайс!A:A,0)),\"\")","v":""},null,{"$f":"IFERROR(INDEX(Прайс!D:D,MATCH(Предложение!B169,Прайс!A:A,0))*(100-$F$12)/100,\"\")","v":""},""]
[157,null,{"$f":"IFERROR(INDEX(Прайс!B:B,MATCH(Предложение!B170,Прайс!A:A,0)),\"\")","v":""},{"$f":"IFERROR(INDEX(Прайс!C:C,MATCH(Предложение!B170,Прайс!A:A,0)),\"\")","v":""},null,{"$f":"IFERROR(INDEX(Прайс!D:D,MATCH(Предложение!B170,Прайс!A:A,0))*(100-$F$12)/100,\"\")","v":""},""]
[158,null,{"$f":"IFERROR(INDEX(Прайс!B:B,MATCH(Предложение!B171,Прайс!A:A,0)),\"\")","v":""},{"$f":"IFERROR(INDEX(Прайс!C:C,MATCH(Предложение!B171,Прайс!A:A,0)),\"\")","v":""},null,{"$f":"IFERROR(INDEX(Прайс!D:D,MATCH(Предложение!B171,Прайс!A:A,0))*(100-$F$12)/100,\"\")","v":""},""]
[159,null,{"$f":"IFERROR(INDEX(Прайс!B:B,MATCH(Предложение!B172,Прайс!A:A,0)),\"\")","v":""},{"$f":"IFERROR(INDEX(Прайс!C:C,MATCH(Предложение!B172,Прайс!A:A,0)),\"\")","v":""},null,{"$f":"IFERROR(INDEX(Прайс!D:D,MATCH(Предложение!B172,Прайс!A:A,0))*(100-$F$12)/100,\"\")","v":""},""]
[160,null,{"$f":"IFERROR(INDEX(Прайс!B:B,MATCH(Предложение!B173,Прайс!A:A,0)),\"\")","v":""},{"$f":"IFERROR(INDEX(Прайс!C:C,MATCH(Предложение!B173,Прайс!A:A,0)),\"\")","v":""},null,{"$f":"IFERROR(INDEX(Прайс!D:D,MATCH(Предложение!B173,Прайс!A:A,0))*(100-$F$12)/100,\"\")","v":""},""]
[161,null,{"$f":"IFERROR(INDEX(Прайс!B:B,MATCH(Предложение!B174,Прайс!A:A,0)),\"\")","v":""},{"$f":"IFERROR(INDEX(Прайс!C:C,MATCH(Предложение!B174,Прайс!A:A,0)),\"\")","v":""},null,{"$f":"IFERROR(INDEX(Прайс!D:D,MATCH(Предложение!B174,Прайс!A:A,0))*(100-$F$12)/100,\"\")","v":""},""]
[162,null,{"$f":"IFERROR(INDEX(Прайс!B:B,MATCH(Предложение!B175,Прайс!A:A,0)),\"\")","v":""},{"$f":"IFERROR(INDEX(Прайс!C:C,MATCH(Предложение!B175,Прайс!A:A,0)),\"\")","v":""},null,{"$f":"IFERROR(INDEX(Прайс!D:D,MATCH(Предложение!B175,Прайс!A:A,0))*(100-$F$12)/100,\"\")","v":""},""]
[163,null,{"$f":"IFERROR(INDEX(Прайс!B:B,MATCH(Предложение!B176,Прайс!A:A,0)),\"\")","v":""},{"$f":"IFERROR(INDEX(Прайс!C:C,MATCH(Предложение!B176,Прайс!A:A,0)),\"\")","v":""},null,{"$f":"IFERROR(INDEX(Прайс!D:D,MATCH(Предложение!B176,Прайс!A:A,0))*(100-$F$12)/100,\"\")","v":""},""]
[164,null,{"$f":"IFERROR(INDEX(Прайс!B:B,MATCH(Предложение!B177,Прайс!A:A,0)),\"\")","v":""},{"$f":"IFERROR(INDEX(Прайс!C:C,MATCH(Предложение!B177,Прайс!A:A,0)),\"\")","v":""},null,{"$f":"IFERROR(INDEX(Прайс!D:D,MATCH(Предложение!B177,Прайс!A:A,0))*(100-$F$12)/100,\"\")","v":""},""]
[165,null,{"$f":"IFERROR(INDEX(Прайс!B:B,MATCH(Предложение!B178,Прайс!A:A,0)),\"\")","v":""},{"$f":"IFERROR(INDEX(Прайс!C:C,MATCH(Предложение!B178,Прайс!A:A,0)),\"\")","v":""},null,{"$f":"IFERROR(INDEX(Прайс!D:D,MATCH(Предложение!B178,Прайс!A:A,0))*(100-$F$12)/100,\"\")","v":""},""]
[166,null,{"$f":"IFERROR(INDEX(Прайс!B:B,MATCH(Предложение!B179,Прайс!A:A,0)),\"\")","v":""},{"$f":"IFERROR(INDEX(Прайс!C:C,MATCH(Предложение!B179,Прайс!A:A,0)),\"\")","v":""},null,{"$f":"IFERROR(INDEX(Прайс!D:D,MATCH(Предложение!B179,Прайс!A:A,0))*(100-$F$12)/100,\"\")","v":""},""]
[167,null,{"$f":"IFERROR(INDEX(Прайс!B:B,MATCH(Предложение!B180,Прайс!A:A,0)),\"\")","v":""},{"$f":"IFERROR(INDEX(Прайс!C:C,MATCH(Предложение!B180,Прайс!A:A,0)),\"\")","v":""},null,{"$f":"IFERROR(INDEX(Прайс!D:D,MATCH(Предложение!B180,Прайс!A:A,0))*(100-$F$12)/100,\"\")","v":""},""]
[168,null,{"$f":"IFERROR(INDEX(Прайс!B:B,MATCH(Предложение!B181,Прайс!A:A,0)),\"\")","v":""},{"$f":"IFERROR(INDEX(Прайс!C:C,MATCH(Предложение!B181,Прайс!A:A,0)),\"\")","v":""},null,{"$f":"IFERROR(INDEX(Прайс!D:D,MATCH(Предложение!B181,Прайс!A:A,0))*(100-$F$12)/100,\"\")","v":""},""]
[169,null,{"$f":"IFERROR(INDEX(Прайс!B:B,MATCH(Предложение!B182,Прайс!A:A,0)),\"\")","v":""},{"$f":"IFERROR(INDEX(Прайс!C:C,MATCH(Предложение!B182,Прайс!A:A,0)),\"\")","v":""},null,{"$f":"IFERROR(INDEX(Прайс!D:D,MATCH(Предложение!B182,Прайс!A:A,0))*(100-$F$12)/100,\"\")","v":""},""]
[170,null,{"$f":"IFERROR(INDEX(Прайс!B:B,MATCH(Предложение!B183,Прайс!A:A,0)),\"\")","v":""},{"$f":"IFERROR(INDEX(Прайс!C:C,MATCH(Предложение!B183,Прайс!A:A,0)),\"\")","v":""},null,{"$f":"IFERROR(INDEX(Прайс!D:D,MATCH(Предложение!B183,Прайс!A:A,0))*(100-$F$12)/100,\"\")","v":""},""]
[171,null,{"$f":"IFERROR(INDEX(Прайс!B:B,MATCH(Предложение!B184,Прайс!A:A,0)),\"\")","v":""},{"$f":"IFERROR(INDEX(Прайс!C:C,MATCH(Предложение!B184,Прайс!A:A,0)),\"\")","v":""},null,{"$f":"IFERROR(INDEX(Прайс!D:D,MATCH(Предложение!B184,Прайс!A:A,0))*(100-$F$12)/100,\"\")","v":""},""]
[172,null,{"$f":"IFERROR(INDEX(Прайс!B:B,MATCH(Предложение!B185,Прайс!A:A,0)),\"\")","v":""},{"$f":"IFERROR(INDEX(Прайс!C:C,MATCH(Предложение!B185,Прайс!A:A,0)),\"\")","v":""},null,{"$f":"IFERROR(INDEX(Прайс!D:D,MATCH(Предложение!B185,Прайс!A:A,0))*(100-$F$12)/100,\"\")","v":""},""]
[173,null,{"$f":"IFERROR(INDEX(Прайс!B:B,MATCH(Предложение!B186,Прайс!A:A,0)),\"\")","v":""},{"$f":"IFERROR(INDEX(Прайс!C:C,MATCH(Предложение!B186,Прайс!A:A,0)),\"\")","v":""},null,{"$f":"IFERROR(INDEX(Прайс!D:D,MATCH(Предложение!B186,Прайс!A:A,0))*(100-$F$12)/100,\"\")","v":""},""]
[174,null,{"$f":"IFERROR(INDEX(Прайс!B:B,MATCH(Предложение!B187,Прайс!A:A,0)),\"\")","v":""},{"$f":"IFERROR(INDEX(Прайс!C:C,MATCH(Предложение!B187,Прайс!A:A,0)),\"\")","v":""},null,{"$f":"IFERROR(INDEX(Прайс!D:D,MATCH(Предложение!B187,Прайс!A:A,0))*(100-$F$12)/100,\"\")","v":""},""]
[175,null,{"$f":"IFERROR(INDEX(Прайс!B:B,MATCH(Предложение!B188,Прайс!A:A,0)),\"\")","v":""},{"$f":"IFERROR(INDEX(Прайс!C:C,MATCH(Предложение!B188,Прайс!A:A,0)),\"\")","v":""},null,{"$f":"IFERROR(INDEX(Прайс!D:D,MATCH(Предложение!B188,Прайс!A:A,0))*(100-$F$12)/100,\"\")","v":""},""]
[176,null,{"$f":"IFERROR(INDEX(Прайс!B:B,MATCH(Предложение!B189,Прайс!A:A,0)),\"\")","v":""},{"$f":"IFERROR(INDEX(Прайс!C:C,MATCH(Предложение!B189,Прайс!A:A,0)),\"\")","v":""},null,{"$f":"IFERROR(INDEX(Прайс!D:D,MATCH(Предложение!B189,Прайс!A:A,0))*(100-$F$12)/100,\"\")","v":""},""]
[177,null,{"$f":"IFERROR(INDEX(Прайс!B:B,MATCH(Предложение!B190,Прайс!A:A,0)),\"\")","v":""},{"$f":"IFERROR(INDEX(Прайс!C:C,MATCH(Предложение!B190,Прайс!A:A,0)),\"\")","v":""},null,{"$f":"IFERROR(INDEX(Прайс!D:D,MATCH(Предложение!B190,Прайс!A:A,0))*(100-$F$12)/100,\"\")","v":""},""]
[178,null,{"$f":"IFERROR(INDEX(Прайс!B:B,MATCH(Предложение!B191,Прайс!A:A,0)),\"\")","v":""},{"$f":"IFERROR(INDEX(Прайс!C:C,MATCH(Предложение!B191,Прайс!A:A,0)),\"\")","v":""},null,{"$f":"IFERROR(INDEX(Прайс!D:D,MATCH(Предложение!B191,Прайс!A:A,0))*(100-$F$12)/100,\"\")","v":""},""]
[179,null,{"$f":"IFERROR(INDEX(Прайс!B:B,MATCH(Предложение!B192,Прайс!A:A,0)),\"\")","v":""},{"$f":"IFERROR(INDEX(Прайс!C:C,MATCH(Предложение!B192,Прайс!A:A,0)),\"\")","v":""},null,{"$f":"IFERROR(INDEX(Прайс!D:D,MATCH(Предложение!B192,Прайс!A:A,0))*(100-$F$12)/100,\"\")","v":""},""]
[180,null,{"$f":"IFERROR(INDEX(Прайс!B:B,MATCH(Предложение!B193,Прайс!A:A,0)),\"\")","v":""},{"$f":"IFERROR(INDEX(Прайс!C:C,MATCH(Предложение!B193,Прайс!A:A,0)),\"\")","v":""},null,{"$f":"IFERROR(INDEX(Прайс!D:D,MATCH(Предложение!B193,Прайс!A:A,0))*(100-$F$12)/100,\"\")","v":""},""]
[181,null,{"$f":"IFERROR(INDEX(Прайс!B:B,MATCH(Предложение!B194,Прайс!A:A,0)),\"\")","v":""},{"$f":"IFERROR(INDEX(Прайс!C:C,MATCH(Предложение!B194,Прайс!A:A,0)),\"\")","v":""},null,{"$f":"IFERROR(INDEX(Прайс!D:D,MATCH(Предложение!B194,Прайс!A:A,0))*(100-$F$12)/100,\"\")","v":""},""]
[182,null,{"$f":"IFERROR(INDEX(Прайс!B:B,MATCH(Предложение!B195,Прайс!A:A,0)),\"\")","v":""},{"$f":"IFERROR(INDEX(Прайс!C:C,MATCH(Предложение!B195,Прайс!A:A,0)),\"\")","v":""},null,{"$f":"IFERROR(INDEX(Прайс!D:D,MATCH(Предложение!B195,Прайс!A:A,0))*(100-$F$12)/100,\"\")","v":""},""]
[183,null,{"$f":"IFERROR(INDEX(Прайс!B:B,MATCH(Предложение!B196,Прайс!A:A,0)),\"\")","v":""},{"$f":"IFERROR(INDEX(Прайс!C:C,MATCH(Предложение!B196,Прайс!A:A,0)),\"\")","v":""},null,{"$f":"IFERROR(INDEX(Прайс!D:D,MATCH(Предложение!B196,Прайс!A:A,0))*(100-$F$12)/100,\"\")","v":""},""]
[184,null,{"$f":"IFERROR(INDEX(Прайс!B:B,MATCH(Предложение!B197,Прайс!A:A,0)),\"\")","v":""},{"$f":"IFERROR(INDEX(Прайс!C:C,MATCH(Предложение!B197,Прайс!A:A,0)),\"\")","v":""},null,{"$f":"IFERROR(INDEX(Прайс!D:D,MATCH(Предложение!B197,Прайс!A:A,0))*(100-$F$12)/100,\"\")","v":""},""]
[185,null,{"$f":"IFERROR(INDEX(Прайс!B:B,MATCH(Предложение!B198,Прайс!A:A,0)),\"\")","v":""},{"$f":"IFERROR(INDEX(Прайс!C:C,MATCH(Предложение!B198,Прайс!A:A,0)),\"\")","v":""},null,{"$f":"IFERROR(INDEX(Прайс!D:D,MATCH(Предложение!B198,Прайс!A:A,0))*(100-$F$12)/100,\"\")","v":""},""]
[186,null,{"$f":"IFERROR(INDEX(Прайс!B:B,MATCH(Предложение!B199,Прайс!A:A,0)),\"\")","v":""},{"$f":"IFERROR(INDEX(Прайс!C:C,MATCH(Предложение!B199,Прайс!A:A,0)),\"\")","v":""},null,{"$f":"IFERROR(INDEX(Прайс!D:D,MATCH(Предложение!B199,Прайс!A:A,0))*(100-$F$12)/100,\"\")","v":""},""]
[187,null,{"$f":"IFERROR(INDEX(Прайс!B:B,MATCH(Предложение!B200,Прайс!A:A,0)),\"\")","v":""},{"$f":"IFERROR(INDEX(Прайс!C:C,MATCH(Предложение!B200,Прайс!A:A,0)),\"\")","v":""},null,{"$f":"IFERROR(INDEX(Прайс!D:D,MATCH(Предложение!B200,Прайс!A:A,0))*(100-$F$12)/100,\"\")","v":""},""]
[188,null,{"$f":"IFERROR(INDEX(Прайс!B:B,MATCH(Предложение!B201,Прайс!A:A,0)),\"\")","v":""},{"$f":"IFERROR(INDEX(Прайс!C:C,MATCH(Предложение!B201,Прайс!A:A,0)),\"\")","v":""},null,{"$f":"IFERROR(INDEX(Прайс!D:D,MATCH(Предложение!B201,Прайс!A:A,0))*(100-$F$12)/100,\"\")","v":""},""]
[189,null,{"$f":"IFERROR(INDEX(Прайс!B:B,MATCH(Предложение!B202,Прайс!A:A,0)),\"\")","v":""},{"$f":"IFERROR(INDEX(Прайс!C:C,MATCH(Предложение!B202,Прайс!A:A,0)),\"\")","v":""},null,{"$f":"IFERROR(INDEX(Прайс!D:D,MATCH(Предложение!B202,Прайс!A:A,0))*(100-$F$12)/100,\"\")","v":""},""]
[190,null,{"$f":"IFERROR(INDEX(Прайс!B:B,MATCH(Предложение!B203,Прайс!A:A,0)),\"\")","v":""},{"$f":"IFERROR(INDEX(Прайс!C:C,MATCH(Предложение!B203,Прайс!A:A,0)),\"\")","v":""},null,{"$f":"IFERROR(INDEX(Прайс!D:D,MATCH(Предложение!B203,Прайс!A:A,0))*(100-$F$12)/100,\"\")","v":""},""]
[191,null,{"$f":"IFERROR(INDEX(Прайс!B:B,MATCH(Предложение!B204,Прайс!A:A,0)),\"\")","v":""},{"$f":"IFERROR(INDEX(Прайс!C:C,MATCH(Предложение!B204,Прайс!A:A,0)),\"\")","v":""},null,{"$f":"IFERROR(INDEX(Прайс!D:D,MATCH(Предложение!B204,Прайс!A:A,0))*(100-$F$12)/100,\"\")","v":""},""]
[192,null,{"$f":"IFERROR(INDEX(Прайс!B:B,MATCH(Предложение!B205,Прайс!A:A,0)),\"\")","v":""},{"$f":"IFERROR(INDEX(Прайс!C:C,MATCH(Предложение!B205,Прайс!A:A,0)),\"\")","v":""},null,{"$f":"IFERROR(INDEX(Прайс!D:D,MATCH(Предложение!B205,Прайс!A:A,0))*(100-$F$12)/100,\"\")","v":""},""]
[193,null,{"$f":"IFERROR(INDEX(Прайс!B:B,MATCH(Предложение!B206,Прайс!A:A,0)),\"\")","v":""},{"$f":"IFERROR(INDEX(Прайс!C:C,MATCH(Предложение!B206,Прайс!A:A,0)),\"\")","v":""},null,{"$f":"IFERROR(INDEX(Прайс!D:D,MATCH(Предложение!B206,Прайс!A:A,0))*(100-$F$12)/100,\"\")","v":""},""]
[{"$f":"IF(A206=\"№ п/п\",1,A206+1)","v":194},null,{"$f":"IFERROR(INDEX(Прайс!B:B,MATCH(Предложение!B207,Прайс!A:A,0)),\"\")","v":""},{"$f":"IFERROR(INDEX(Прайс!C:C,MATCH(Предложение!B207,Прайс!A:A,0)),\"\")","v":""},null,{"$f":"IFERROR(INDEX(Прайс!D:D,MATCH(Предложение!B207,Прайс!A:A,0))*(100-$F$12)/100,\"\")","v":""},{"$f":"IFERROR(E207*F207,\"\")","v":""}]
[195,null,{"$f":"IFERROR(INDEX(Прайс!B:B,MATCH(Предложение!B208,Прайс!A:A,0)),\"\")","v":""},{"$f":"IFERROR(INDEX(Прайс!C:C,MATCH(Предложение!B208,Прайс!A:A,0)),\"\")","v":""},null,{"$f":"IFERROR(INDEX(Прайс!D:D,MATCH(Предложение!B208,Прайс!A:A,0))*(100-$F$12)/100,\"\")","v":""},""]
[196,null,{"$f":"IFERROR(INDEX(Прайс!B:B,MATCH(Предложение!B209,Прайс!A:A,0)),\"\")","v":""},{"$f":"IFERROR(INDEX(Прайс!C:C,MATCH(Предложение!B209,Прайс!A:A,0)),\"\")","v":""},null,{"$f":"IFERROR(INDEX(Прайс!D:D,MATCH(Предложение!B209,Прайс!A:A,0))*(100-$F$12)/100,\"\")","v":""},""]
[197,null,{"$f":"IFERROR(INDEX(Прайс!B:B,MATCH(Предложение!B210,Прайс!A:A,0)),\"\")","v":""},{"$f":"IFERROR(INDEX(Прайс!C:C,MATCH(Предложение!B210,Прайс!A:A,0)),\"\")","v":""},null,{"$f":"IFERROR(INDEX(Прайс!D:D,MATCH(Предложение!B210,Прайс!A:A,0))*(100-$F$12)/100,\"\")","v":""},""]
[198,null,{"$f":"IFERROR(INDEX(Прайс!B:B,MATCH(Предложение!B211,Прайс!A:A,0)),\"\")","v":""},{"$f":"IFERROR(INDEX(Прайс!C:C,MATCH(Предложение!B211,Прайс!A:A,0)),\"\")","v":""},null,{"$f":"IFERROR(INDEX(Прайс!D:D,MATCH(Предложение!B211,Прайс!A:A,0))*(100-$F$12)/100,\"\")","v":""},""]
[199,null,{"$f":"IFERROR(INDEX(Прайс!B:B,MATCH(Предложение!B212,Прайс!A:A,0)),\"\")","v":""},{"$f":"IFERROR(INDEX(Прайс!C:C,MATCH(Предложение!B212,Прайс!A:A,0)),\"\")","v":""},null,{"$f":"IFERROR(INDEX(Прайс!D:D,MATCH(Предложение!B212,Прайс!A:A,0))*(100-$F$12)/100,\"\")","v":""},""]
[200,null,{"$f":"IFERROR(INDEX(Прайс!B:B,MATCH(Предложение!B213,Прайс!A:A,0)),\"\")","v":""},{"$f":"IFERROR(INDEX(Прайс!C:C,MATCH(Предложение!B213,Прайс!A:A,0)),\"\")","v":""},null,{"$f":"IFERROR(INDEX(Прайс!D:D,MATCH(Предложение!B213,Прайс!A:A,0))*(100-$F$12)/100,\"\")","v":""},""]
[]
[null,null,null,null,null,"Итого, руб.:",{"$f":"SUM(G14:G213)","v":0}]
[null,null,null,null,null,"В т.ч. НДС 20%:",{"$f":"G215*20/120","v":0}]

{"sheet":"MPx_Add","index":1,"n_rows":230,"n_cols":62,"rows_kept":230,"cut":false,"hidden":true,"merged":[]}
[1,2,3,4,5,6,7,8,9,10,11,12,13,14,15,16,17,18,19,20,21,22,23,24,25,26,27,28,29,30,31,32,33,34,35,36,37,38,39,40,41,42,43,44,45,46,47,48,49,50,51,52,53,54,55,56,57,58,59,60,61,62]
[null,null,null,null,null,null,null,null,null,null,null,null,1,2,3,4,5,6,7,8,9,10,11,12,13,14,15,16,17,18,19,20,21,22,23,24,25,26,27,28,29,30,31,32,33,34,35,36,37,38,39,40,41,42,43,44,45,46,47,48,49,50]
[null,"- высота",null,"-ширина",null,null,"-глубина",null,"MPS","-серия"]
[{"$f":"CONCATENATE(A3/10,\".\",C3/10,\".\",F3/10)","v":"0.0.0"},"- артикул шкафа"]
[{"$f":"IFERROR(MATCH(CONCATENATE(\"MPS \",A4),M5:BJ5,0),MATCH(CONCATENATE(\"MPD \",A4),M5:BJ5,0))","v":{"$error":"#N/A"}},"- номер столбца","Value","Combo_Add","Check_caption_tmp","Check_caption_tmp","Combo_Index","Enabled","Check_Value","Артикул","Кол-во","Артикул","MPS 120.60.60","MPS 120.80.40","MPS 120.80.60","MPS 140.60.60","MPS 160.60.40","MPS 160.60.50","MPS 160.60.60","MPS 160.60.80","MPS 160.80.40","MPS 160.80.50","MPS 160.80.60","MPS 180.40.50","MPS 180.40.60","MPS 180.60.40","MPS 180.60.50","MPS 180.60.60","MPS 180.80.40","MPS 180.80.50","MPS 180.80.60","MPS 200.40.50","MPS 200.40.60","MPS 200.60.40","MPS 200.60.50","MPS 200.60.60","MPS 200.60.80","MPS 200.80.40","MPS 200.80.50","MPS 200.80.60","MPS 200.80.80","MPS 220.60.60","MPS 220.60.80","MPS 220.80.40","MPS 220.80.60","MPS 220.80.80","MPD 120.80.50","MPD 180.100.40","MPD 180.120.40","MPD 180.120.50","MPD 180.120.60","MPD 200.100.40","MPD 200.100.50","MPD 200.100.60","MPD 200.100.80","MPD 200.120.40","MPD 200.120.50","MPD 200.120.60","MPD 200.120.80","MPD 220.100.60","MPD 220.100.80","MPD 220.120.60"]
[null,null,null,null,"Combo_selected",null,null,null,null,null,null,"Серия","MPS","MPS","MPS","MPS","MPS","MPS","MPS","MPS","MPS","MPS","MPS","MPS","MPS","MPS","MPS","MPS","MPS","MPS","MPS","MPS","MPS","MPS","MPS","MPS","MPS","MPS","MPS","MPS","MPS","MPS","MPS","MPS","MPS","MPS","MPD","MPD","MPD","MPD","MPD","MPD","MPD","MPD","MPD","MPD","MPD","MPD","MPD","MPD","MPD","MPD"]
[null,null,null,null,null,null,null,null,null,null,null,"Высота",1200,1200,1200,1400,1600,1600,1600,1600,1600,1600,1600,1800,1800,1800,1800,1800,1800,1800,1800,2000,2000,2000,2000,2000,2000,2000,2000,2000,2000,2200,2200,2200,2200,2200,1200,1800,1800,1800,1800,2000,2000,2000,2000,2000,2000,2000,2000,2200,2200,2200]
["LastUsed Row",36,null,null,null,null,null,null,null,null,null,"Ширина",600,800,800,600,600,600,600,600,800,800,800,400,400,600,600,600,800,800,800,400,400,600,600,600,600,800,800,800,800,600,600,800,800,800,800,1000,1200,1200,1200,1000,1000,1000,1000,1200,1200,1200,1200,1000,1000,1200]
[null,null,null,null,null,null,null,null,null,null,null,"Глубина",600,400,600,600,400,500,600,800,400,500,600,500,600,400,500,600,400,500,600,500,600,400,500,600,800,400,500,600,800,600,800,400,600,800,500,400,400,500,600,400,500,600,800,400,500,600,800,600,800,600]
["PAGE1","Label4",{"$f":"IFERROR(CONCATENATE(J12,\" \",INDEX(Наименования!B:B,MATCH(MPx_Add!J12,Наименования!A:A,0))),\"пусто\")","v":"пусто"},null,null,null,null,null,null,null,1,"Артикул+Наименование"]
["PAGE1","Label7",{"$f":"IFERROR(INDEX(Наименования!C:C,MATCH(MPx_Add!J12,Наименования!A:A,0)),\"пусто\")","v":"пусто"},null,null,null,null,null,null,null,1,"Комплект поставки"]
["PAGE1","TextBox1",null,null,null,null,null,null,null,{"$f":"IFERROR(INDEX(M5:BJ5,1,A5),\"\")","v":""},1,"Кол-во шкафов"]
["PAGE1","CheckBox20",{"$f":"IFERROR(INDEX(M13:BJ13,1,$A$5),\"пусто\")","v":"пусто"},null,{"$f":"IF(OR(F13=\"0- \",F13=\"0-\"),\"Боковые стенки\",F13)","v":"пусто "},{"$f":"IFERROR(CONCATENATE(C13,\" \",INDEX(Наименования!B:B,MATCH(C13,Наименования!A:A,0))),\"пусто\")","v":"пусто "},null,{"$f":"IF(E13=F13,TRUE,FALSE)","v":true},null,{"$f":"IFERROR(IF(I13,C13,\"\"),\"\")","v":""},1,"Боковые стенки","SP 120.60","SP 120.40","SP 120.60","SP 140.60","SP 160.40","SP 160.50","SP 160.60","SP 160.80","SP 160.40","SP 160.50","SP 160.60","SP 180.50","SP 180.60","SP 180.40","SP 180.50","SP 180.60","SP 180.40","SP 180.50","SP 180.60","SP 200.50","SP 200.60","SP 200.40","SP 200.50","SP 200.60","SP 200.80","SP 200.40","SP 200.50","SP 200.60","SP 200.80","SP 220.60","SP 220.80","SP 220.40","SP 220.60","SP 220.80","SP 120.50","SP 180.40","SP 180.40","SP 180.50","SP 180.60","SP 200.40","SP 200.50","SP 200.60","SP 200.80","SP 200.40","SP 200.50","SP 200.60","SP 200.80","SP 220.60","SP 220.80","SP 220.60"]
["PAGE1","CheckBox31",{"$f":"IFERROR(INDEX(C15:C17,G14),\"пусто\")","v":"пусто"},null,null,null,{"$f":"MATCH(E15,D15:D17,0)","v":{"$error":"#N/A"}},null,null,{"$f":"IFERROR(IF(I14,C14,\"\"),\"\")","v":""},1,"Задняя плоскость"]
["PAGE1","ComboBox13_1",{"$f":"IFERROR(INDEX(M15:BJ15,1,$A$5),\"пусто\")","v":"пусто"},{"$f":"CONCATENATE(C15,\" \",INDEX(Наименования!B:B,MATCH(MPx_Add!C15,Наименования!A:A,0)))","v":"пусто "},"D 180.80 Дверь шкафа MPx одностворчатая 1800х800мм 1шт",null,null,null,null,null,1,"Задняя плоскость-дверь 1х","D 120.60","D 120.80","D 120.80","D 140.60","D 160.60","D 160.60","D 160.60","D 160.60","D 160.80","D 160.80","D 160.80","D 180.40","D 180.40","D 180.60","D 180.60","D 180.60","D 180.80","D 180.80","D 180.80","D 200.40","D 200.40","D 200.60","D 200.60","D 200.60","D 200.60","D 200.80","D 200.80","D 200.80","D 200.80","D 220.60","D 220.60","D 220.80","D 220.80","D 220.80","D 120.80","0-","0-","0-","0-","0-","0-","0-","0-","0-","0-","0-","0-","0-","0-","0-"]
["PAGE1","ComboBox13_2",{"$f":"IFERROR(INDEX(M16:BJ16,1,$A$5),\"пусто\")","v":"пусто"},{"$f":"CONCATENATE(C16,\" \",INDEX(Наименования!B:B,MATCH(MPx_Add!C16,Наименования!A:A,0)))","v":"пусто "},null,null,null,null,null,null,1,"Задняя плоскость-дверь 2х","0-","0-","0-","0-","0-","0-","0-","0-","0-","0-","0-","0-","0-","0-","0-","0-","D 180.80 D","D 180.80 D","D 180.80 D","0-","0-","D 200.60 D","D 200.60 D","D 200.60 D","D 200.60 D","D 200.80 D","D 200.80 D","D 200.80 D","D 200.80 D","0-","0-","D 220.80 D","D 220.80 D","D 220.80 D","0-","D 180.100 D","D 180.120 D","D 180.120 D","D 180.120 D","D 200.100 D","D 200.100 D","D 200.100 D","D 200.100 D","D 200.120 D","D 200.120 D","D 200.120 D","D 200.120 D","D 220.100 D","D 220.100 D","D 220.120 D"]
["PAGE1","ComboBox13_3",{"$f":"IFERROR(INDEX(M17:BJ17,1,$A$5),\"пусто\")","v":"пусто"},"Оставить сплошную панель",null,null,null,null,null,null,1,"Оставить сплошную панель"]
["PAGE1","CheckBox41",{"$f":"IFERROR(INDEX(C19:C22,G18),\"пусто\")","v":"пусто"},null,null,null,{"$f":"MATCH(E19,D19:D22,0)","v":{"$error":"#N/A"}},null,null,{"$f":"IFERROR(IF(I18,C18,\"\"),\"\")","v":""},1,"Доп. Монтажная панель"]
["PAGE1","ComboBox18_1",{"$f":"IFERROR(INDEX(M19:BJ19,1,$A$5),\"пусто\")","v":"пусто"},{"$f":"CONCATENATE(C19,\" \",INDEX(Наименования!B:B,MATCH(MPx_Add!C19,Наименования!A:A,0)))","v":"пусто "},"MP 200.80 Монтажная панель MPx 2000x800мм 1шт",null,null,null,null,null,1,"МП сплошная","MP 120.60","MP 120.80","MP 120.80","0-","MP 160.60","MP 160.60","MP 160.60","MP 160.60","MP 160.80","MP 160.80","MP 160.80","MP 180.40","MP 180.40","MP 180.60","MP 180.60","MP 180.60","MP 180.80","MP 180.80","MP 180.80","MP 200.40","MP 200.40","MP 200.60","MP 200.60","MP 200.60","MP 200.60","MP 200.80","MP 200.80","MP 200.80","MP 200.80","MP 220.60","MP 220.60","MP 220.80","MP 220.80","MP 220.80","MP 120.80","MP 180.100","MP 180.120","MP 180.120","MP 180.120","MP 200.100","MP 200.100","MP 200.100","MP 200.100","MP 200.120","MP 200.120","MP 200.120","MP 200.120","MP 220.100","MP 220.100","MP 220.120"]
["PAGE1","ComboBox18_2","пусто",{"$f":"CONCATENATE(C20,\" \",INDEX(Наименования!B:B,MATCH(MPx_Add!C20,Наименования!A:A,0)))","v":"пусто "},null,null,null,null,null,null,1,"МП микроперфорация","0-","0-","0-","0-","0-","0-","0-","0-","0-","0-","0-","0-","0-","MP 180.60 P","MP 180.60 P","MP 180.60 P","MP 180.80 P","MP 180.80 P","MP 180.80 P","0-","0-","MP 200.60 P","MP 200.60 P","MP 200.60 P","MP 200.60 P","MP 200.80 P","MP 200.80 P","MP 200.80 P","MP 200.80 P","MP 220.60 P","MP 220.60 P","MP 220.80 P","MP 220.80 P","MP 220.80 P","0-","MP 180.100 P","MP 180.120 P","MP 180.120 P","MP 180.120 P","MP 200.100 P","MP 200.100 P","MP 200.100 P","MP 200.100 P","MP 200.120 P","MP 200.120 P","MP 200.120 P","MP 200.120 P","0-","0-","MP 220.120 P"]
["PAGE1","ComboBox18_3","пусто",{"$f":"CONCATENATE(C21,\" \",INDEX(Наименования!B:B,MATCH(MPx_Add!C21,Наименования!A:A,0)))","v":"пусто "},null,null,null,null,null,null,1,"МП сетка","0-","0-","0-","0-","0-","0-","0-","0-","0-","0-","0-","0-","0-","MN 180.60","MN 180.60","MN 180.60","MN 180.80","MN 180.80","MN 180.80","0-","0-","MN 200.60","MN 200.60","MN 200.60","MN 200.60","MN 200.80","MN 200.80","MN 200.80","MN 200.80","0-","0-","0-","0-","0-","0-","MN 180.100","0-","0-","0-","MN 200.100","MN 200.100","MN 200.100","MN 200.100","0-","0-","0-","0-","0-","0-","0-"]
["PAGE1","ComboBox18_4","пусто","Нет",null,null,null,null,null,null,1,"нет","Нет","Нет","Нет","Нет","Нет","Нет","Нет","Нет","Нет","Нет","Нет","Нет","Нет","Нет","Нет","Нет","Нет","Нет","Нет","Нет","Нет","Нет","Нет","Нет","Нет","Нет","Нет","Нет","Нет","Нет","Нет","Нет","Нет","Нет","Нет","Нет","Нет","Нет","Нет","Нет","Нет","Нет","Нет","Нет","Нет","Нет","Нет","Нет","Нет","Нет"]
["PAGE1","CheckBox30","пусто",null,{"$f":"IF(OR(F23=\"0- \",F23=\"0-\"),\"Защитный козырек\",F23)","v":"пусто "},{"$f":"IFERROR(CONCATENATE(C23,\" \",INDEX(Наименования!B:B,MATCH(C23,Наименования!A:A,0))),\"пусто\")","v":"пусто "},null,{"$f":"IF(E23=F23,TRUE,FALSE)","v":true},null,{"$f":"IFERROR(IF(I23,C23,\"\"),\"\")","v":""},1,"Защитный козырек","R 60.60","R 80.40","R 80.60","R 60.60","R 60.40","R 60.50","R 60.60","R 60.80","R 80.40","R 80.50","R 80.60","0-","0-","R 60.40","R 60.50","R 60.60","R 80.40","R 80.50","R 80.60","0-","0-","R 60.40","R 60.50","R 60.60","R 60.80","R 80.40","R 80.50","R 80.60","R 80.80","R 60.60","R 60.80","R 80.40","R 80.60","R 80.80","R 80.50","R 100.40","R 120.40","R 120.50","R 120.60","R 100.40","0-","R 100.60","R 100.80","R 120.40","R 120.50","R 120.60","R 120.80","R 100.60","R 100.80","R 120.60"]
["PAGE1","CheckBox39","пусто",null,{"$f":"F24","v":"пусто "},{"$f":"IFERROR(CONCATENATE(C24,\" \",INDEX(Наименования!B:B,MATCH(C24,Наименования!A:A,0))),\"пусто\")","v":"пусто "},null,null,null,"",1,"Рым-болты","LE 12","LE 12","LE 12","LE 12","LE 12","LE 12","LE 12","LE 12","LE 12","LE 12","LE 12","LE 12","LE 12","LE 12","LE 12","LE 12","LE 12","LE 12","LE 12","LE 12","LE 12","LE 12","LE 12","LE 12","LE 12","LE 12","LE 12","LE 12","LE 12","LE 12","LE 12","LE 12","LE 12","LE 12","LE 12","LE 12","LE 12","LE 12","LE 12","LE 12","LE 12","LE 12","LE 12","LE 12","LE 12","LE 12","LE 12","LE 12","LE 12","LE 12"]
["PAGE1","CheckBox42","пусто",null,{"$f":"F25","v":"пусто "},{"$f":"IFERROR(CONCATENATE(C25,\" \",INDEX(Наименования!B:B,MATCH(C25,Наименования!A:A,0))),\"пусто\")","v":"пусто "},null,null,null,"",1,"Компл. Для соединения","IK 01","IK 01","IK 01","IK 01","IK 01","IK 01","IK 01","IK 01","IK 01","IK 01","IK 01","IK 01","IK 01","IK 01","IK 01","IK 01","IK 01","IK 01","IK 01","IK 01","IK 01","IK 01","IK 01","IK 01","IK 01","IK 01","IK 01","IK 01","IK 01","IK 01","IK 01","IK 01","IK 01","IK 01","IK 01","IK 01","IK 01","IK 01","IK 01","IK 01","IK 01","IK 01","IK 01","IK 01","IK 01","IK 01","IK 01","IK 01","IK 01","IK 01"]
["PAGE1","CheckBox44","пусто",null,"пусто ",{"$f":"IFERROR(CONCATENATE(C26,\" \",INDEX(Наименования!B:B,MATCH(C26,Наименования!A:A,0))),\"пусто\")","v":"пусто "},null,null,null,"",1,"Соед. Цоколей","IK 01 ZA v.2","IK 01 ZA v.2","IK 01 ZA v.2","IK 01 ZA v.2","IK 01 ZA v.2","IK 01 ZA v.2","IK 01 ZA v.2","IK 01 ZA v.2","IK 01 ZA v.2","IK 01 ZA v.2","IK 01 ZA v.2","IK 01 ZA v.2","IK 01 ZA v.2","IK 01 ZA v.2","IK 01 ZA v.2","IK 01 ZA v.2","IK 01 ZA v.2","IK 01 ZA v.2","IK 01 ZA v.2","IK 01 ZA v.2","IK 01 ZA v.2","IK 01 ZA v.2","IK 01 ZA v.2","IK 01 ZA v.2","IK 01 ZA v.2","IK 01 ZA v.2","IK 01 ZA v.2","IK 01 ZA v.2","IK 01 ZA v.2","IK 01 ZA v.2","IK 01 ZA v.2","IK 01 ZA v.2","IK 01 ZA v.2","IK 01 ZA v.2","IK 01 ZA v.2","IK 01 ZA v.2","IK 01 ZA v.2","IK 01 ZA v.2","IK 01 ZA v.2","IK 01 ZA v.2","IK 01 ZA v.2","IK 01 ZA v.2","IK 01 ZA v.2","IK 01 ZA v.2","IK 01 ZA v.2","IK 01 ZA v.2","IK 01 ZA v.2","IK 01 ZA v.2","IK 01 ZA v.2","IK 01 ZA v.2"]
["PAGE1","CheckBox45","пусто",null,{"$f":"IF(OR(F27=\"0- \",F27=\"0-\"),\"Панель монтажная промежуточная\",F27)","v":"пусто "},{"$f":"IFERROR(CONCATENATE(C27,\" \",INDEX(Наименования!B:B,MATCH(C27,Наименования!A:A,0))),\"пусто\")","v":"пусто "},null,{"$f":"IF(E27=F27,TRUE,FALSE)","v":true},null,"",1,"МП промежуточная","0-","0-","0-","0-","MP 160.11","MP 160.11","MP 160.11","MP 160.11","MP 160.11","MP 160.11","MP 160.11","MP 180.11","MP 180.11","MP 180.11","MP 180.11","MP 180.11","MP 180.11","MP 180.11","MP 180.11","MP 200.11","MP 200.11","MP 200.11","MP 200.11","MP 200.11","MP 200.11","MP 200.11","MP 200.11","MP 200.11","MP 200.11","MP 220.11","MP 220.11","MP 220.11","MP 220.11","MP 220.11","0-","MP 180.11","MP 180.11","MP 180.11","MP 180.11","MP 200.11","MP 200.11","MP 200.11","MP 200.11","MP 200.11","MP 200.11","MP 200.11","MP 200.11","MP 220.11","MP 220.11","MP 220.11"]
["PAGE1","CheckBox46","пусто",null,{"$f":"F28","v":"пусто "},{"$f":"IFERROR(CONCATENATE(C28,\" \",INDEX(Наименования!B:B,MATCH(C28,Наименования!A:A,0))),\"пусто\")","v":"пусто "},null,null,null,"",1,"Кроншт. д/транспорт. Ряда","LL 12","LL 12","LL 12","LL 12","LL 12","LL 12","LL 12","LL 12","LL 12","LL 12","LL 12","LL 12","LL 12","LL 12","LL 12","LL 12","LL 12","LL 12","LL 12","LL 12","LL 12","LL 12","LL 12","LL 12","LL 12","LL 12","LL 12","LL 12","LL 12","LL 12","LL 12","LL 12","LL 12","LL 12","LL 12","LL 12","LL 12","LL 12","LL 12","LL 12","LL 12","LL 12","LL 12","LL 12","LL 12","LL 12","LL 12","LL 12","LL 12","LL 12"]
["PAGE1","CheckBox47","пусто",null,{"$f":"F29","v":"пусто "},{"$f":"IFERROR(CONCATENATE(C29,\" \",INDEX(Наименования!B:B,MATCH(C29,Наименования!A:A,0))),\"пусто\")","v":"пусто "},null,null,null,"",1,"Крышка промежуточная","GB 60 R","GB 40 R","GB 60 R","GB 60 R","GB 40 R","GB 50 R","GB 60 R","GB 80 R","GB 40 R","GB 50 R","GB 60 R","GB 50 R","GB 60 R","GB 40 R","GB 50 R","GB 60 R","GB 40 R","GB 50 R","GB 60 R","GB 50 R","GB 60 R","GB 40 R","GB 50 R","GB 60 R","GB 80 R","GB 40 R","GB 50 R","GB 60 R","GB 80 R","GB 60 R","GB 80 R","GB 40 R","GB 60 R","GB 80 R","GB 50 R","GB 40 R","GB 40 R","GB 50 R","GB 60 R","GB 40 R","GB 50 R","GB 60 R","GB 80 R","GB 40 R","GB 50 R","GB 60 R","GB 80 R","GB 60 R","GB 80 R","GB 60 R"]
["PAGE1","CheckBox48","пусто",null,{"$f":"IF(OR(F30=\"0- \",F30=\"0-\"),\"Разделительная панель\",F30)","v":"пусто "},{"$f":"IFERROR(CONCATENATE(C30,\" \",INDEX(Наименования!B:B,MATCH(C30,Наименования!A:A,0))),\"пусто\")","v":"пусто "},null,{"$f":"IF(E30=F30,TRUE,FALSE)","v":true},null,"",1,"Панель разделительная","0-","0-","0-","0-","0-","0-","0-","0-","0-","0-","0-","SP 180.50 N","SP 180.60 N","SP 180.40 N","SP 180.50 N","SP 180.60 N","SP 180.40 N","SP 180.50 N","SP 180.60 N","SP 200.50 N","SP 200.60 N","SP 200.40 N","SP 200.50 N","SP 200.60 N","SP 200.80 N","SP 200.40 N","SP 200.50 N","SP 200.60 N","SP 200.80 N","SP 220.60 N","SP 220.80 N","0-","SP 220.60 N","SP 220.80 N","0-","SP 180.40 N","SP 180.40 N","SP 180.50 N","SP 180.60 N","SP 200.40 N","SP 200.50 N","SP 200.60 N","SP 200.80 N","SP 200.40 N","SP 200.50 N","SP 200.60 N","SP 200.80 N","SP 220.60 N","SP 220.80 N","SP 220.60 N"]
["PAGE2","CheckBox7",{"$f":"IFERROR(INDEX(C32:C34,G31),\"пусто\")","v":"пусто"},null,null,null,{"$f":"MATCH(E32,D32:D34,0)","v":{"$error":"#N/A"}},null,null,"",1,"Цоколь перед/зад"]
["PAGE2","Sokol_1",{"$f":"IFERROR(INDEX(M32:BJ32,1,$A$5),\"пусто\")","v":"пусто"},{"$f":"CONCATENATE(C32,\" \",INDEX(Наименования!B:B,MATCH(MPx_Add!C32,Наименования!A:A,0)))","v":"пусто "},"ZA 80.00 v.2 Элементы цоколя передний и задний 100х800мм 2шт",{"$f":"IFERROR(CONCATENATE(C32,\" \",INDEX(Наименования!B:B,MATCH(C32,Наименования!A:A,0))),\"пусто\")","v":"пусто "},null,null,null,null,1,"Цоколь перед/зад 100мм","ZA 60.00 v.2","ZA 80.00 v.2","ZA 80.00 v.2","ZA 60.00 v.2","ZA 60.00 v.2","ZA 60.00 v.2","ZA 60.00 v.2","ZA 60.00 v.2","ZA 80.00 v.2","ZA 80.00 v.2","ZA 80.00 v.2","ZA 40.00 v.2","ZA 40.00 v.2","ZA 60.00 v.2","ZA 60.00 v.2","ZA 60.00 v.2","ZA 80.00 v.2","ZA 80.00 v.2","ZA 80.00 v.2","ZA 40.00 v.2","ZA 40.00 v.2","ZA 60.00 v.2","ZA 60.00 v.2","ZA 60.00 v.2","ZA 60.00 v.2","ZA 80.00 v.2","ZA 80.00 v.2","ZA 80.00 v.2","ZA 80.00 v.2","ZA 60.00 v.2","ZA 60.00 v.2","ZA 80.00 v.2","ZA 80.00 v.2","ZA 80.00 v.2","ZA 80.00 v.2","ZA 100.00 v.2","ZA 120.00 v.2","ZA 120.00 v.2","ZA 120.00 v.2","ZA 100.00 v.2","ZA 100.00 v.2","ZA 100.00 v.2","ZA 100.00 v.2","ZA 120.00 v.2","ZA 120.00 v.2","ZA 120.00 v.2","ZA 120.00 v.2","ZA 100.00 v.2","ZA 100.00 v.2","ZA 120.00 v.2"]
["PAGE2","Sokol_2",{"$f":"IFERROR(INDEX(M33:BJ33,1,$A$5),\"пусто\")","v":"пусто"},{"$f":"CONCATENATE(C33,\" \",INDEX(Наименования!B:B,MATCH(MPx_Add!C33,Наименования!A:A,0)))","v":"пусто "},null,{"$f":"IFERROR(CONCATENATE(C33,\" \",INDEX(Наименования!B:B,MATCH(C33,Наименования!A:A,0))),\"пусто\")","v":"пусто "},null,null,null,null,1,"Цоколь перед/зад 200мм","ZA 60.00 H v.2","ZA 80.00 H v.2","ZA 80.00 H v.2","ZA 60.00 H v.2","ZA 60.00 H v.2","ZA 60.00 H v.2","ZA 60.00 H v.2","ZA 60.00 H v.2","ZA 80.00 H v.2","ZA 80.00 H v.2","ZA 80.00 H v.2","ZA 40.00 H v.2","ZA 40.00 H v.2","ZA 60.00 H v.2","ZA 60.00 H v.2","ZA 60.00 H v.2","ZA 80.00 H v.2","ZA 80.00 H v.2","ZA 80.00 H v.2","ZA 40.00 H v.2","ZA 40.00 H v.2","ZA 60.00 H v.2","ZA 60.00 H v.2","ZA 60.00 H v.2","ZA 60.00 H v.2","ZA 80.00 H v.2","ZA 80.00 H v.2","ZA 80.00 H v.2","ZA 80.00 H v.2","ZA 60.00 H v.2","ZA 60.00 H v.2","ZA 80.00 H v.2","ZA 80.00 H v.2","ZA 80.00 H v.2","ZA 80.00 H v.2","ZA 100.00 H v.2","ZA 120.00 H v.2","ZA 120.00 H v.2","ZA 120.00 H v.2","ZA 100.00 H v.2","ZA 100.00 H v.2","ZA 100.00 H v.2","ZA 100.00 H v.2","ZA 120.00 H v.2","ZA 120.00 H v.2","ZA 120.00 H v.2","ZA 120.00 H v.2","ZA 100.00 H v.2","ZA 100.00 H v.2","ZA 120.00 H v.2"]
["PAGE2","Sokol_3",{"$f":"IFERROR(INDEX(M34:BJ34,1,$A$5),\"пусто\")","v":"пусто"},"Нет",null,null,null,null,null,null,1,"Нет","Нет","Нет","Нет","Нет","Нет","Нет","Нет","Нет","Нет","Нет","Нет","Нет","Нет","Нет","Нет","Нет","Нет","Нет","Нет","Нет","Нет","Нет","Нет","Нет","Нет","Нет","Нет","Нет","Нет","Нет","Нет","Нет","Нет","Нет","Нет","Нет","Нет","Нет","Нет","Нет","Нет","Нет","Нет","Нет","Нет","Нет","Нет","Нет","Нет","Нет"]
["PAGE2","CheckBox9",{"$f":"IFERROR(INDEX(C36:C39,G35),\"пусто\")","v":"пусто"},null,null,null,{"$f":"MATCH(E36,D36:D39,0)","v":{"$error":"#N/A"}},null,null,{"$f":"IFERROR(IF(I35,C35,\"\"),\"\")","v":""},1,"Цоколь бок"]
["PAGE2","Sokol_bok_1",{"$f":"IFERROR(INDEX(M36:BJ36,1,$A$5),\"пусто\")","v":"пусто"},{"$f":"CONCATENATE(C36,\" \",INDEX(Наименования!B:B,MATCH(MPx_Add!C36,Наименования!A:A,0)))","v":"пусто "},"ZA 00.50 H v.2 Боковые панели цоколя 200х500мм 2шт",{"$f":"IFERROR(CONCATENATE(C36,\" \",INDEX(Наименования!B:B,MATCH(C36,Наименования!A:A,0))),\"пусто\")","v":"пусто "},null,null,null,null,1,"Цоколь бок 100 сплошные","ZA 00.60 v.2","ZA 00.40 v.2","ZA 00.60 v.2","ZA 00.60 v.2","ZA 00.40 v.2","ZA 00.50 v.2","ZA 00.60 v.2","ZA 00.80 v.2","ZA 00.40 v.2","ZA 00.50 v.2","ZA 00.60 v.2","ZA 00.50 v.2","ZA 00.60 v.2","ZA 00.40 v.2","ZA 00.50 v.2","ZA 00.60 v.2","ZA 00.40 v.2","ZA 00.50 v.2","ZA 00.60 v.2","ZA 00.50 v.2","ZA 00.60 v.2","ZA 00.40 v.2","ZA 00.50 v.2","ZA 00.60 v.2","ZA 00.80 v.2","ZA 00.40 v.2","ZA 00.50 v.2","ZA 00.60 v.2","ZA 00.80 v.2","ZA 00.60 v.2","ZA 00.80 v.2","ZA 00.40 v.2","ZA 00.60 v.2","ZA 00.80 v.2","ZA 00.50 v.2","ZA 00.40 v.2","ZA 00.40 v.2","ZA 00.50 v.2","ZA 00.60 v.2","ZA 00.40 v.2","ZA 00.50 v.2","ZA 00.60 v.2","ZA 00.80 v.2","ZA 00.40 v.2","ZA 00.50 v.2","ZA 00.60 v.2","ZA 00.80 v.2","ZA 00.60 v.2","ZA 00.80 v.2","ZA 00.60 v.2"]
["PAGE2","Sokol_bok_2",{"$f":"IFERROR(INDEX(M37:BJ37,1,$A$5),\"пусто\")","v":"пусто"},{"$f":"CONCATENATE(C37,\" \",INDEX(Наименования!B:B,MATCH(MPx_Add!C37,Наименования!A:A,0)))","v":"пусто "},null,{"$f":"IFERROR(CONCATENATE(C37,\" \",INDEX(Наименования!B:B,MATCH(C37,Наименования!A:A,0))),\"пусто\")","v":"пусто "},null,null,null,null,1,"Цоколь бок 200 сплошные","ZA 00.60 H v.2","ZA 00.40 H v.2","ZA 00.60 H v.2","ZA 00.60 H v.2","ZA 00.40 H v.2","ZA 00.50 H v.2","ZA 00.60 H v.2","ZA 00.80 H v.2","ZA 00.40 H v.2","ZA 00.50 H v.2","ZA 00.60 H v.2","ZA 00.50 H v.2","ZA 00.60 H v.2","ZA 00.40 H v.2","ZA 00.50 H v.2","ZA 00.60 H v.2","ZA 00.40 H v.2","ZA 00.50 H v.2","ZA 00.60 H v.2","ZA 00.50 H v.2","ZA 00.60 H v.2","ZA 00.40 H v.2","ZA 00.50 H v.2","ZA 00.60 H v.2","ZA 00.80 H v.2","ZA 00.40 H v.2","ZA 00.50 H v.2","ZA 00.60 H v.2","ZA 00.80 H v.2","ZA 00.60 H v.2","ZA 00.80 H v.2","ZA 00.40 H v.2","ZA 00.60 H v.2","ZA 00.80 H v.2","ZA 00.50 H v.2","ZA 00.40 H v.2","ZA 00.40 H v.2","ZA 00.50 H v.2","ZA 00.60 H v.2","ZA 00.40 H v.2","ZA 00.50 H v.2","ZA 00.60 H v.2","ZA 00.80 H v.2","ZA 00.40 H v.2","ZA 00.50 H v.2","ZA 00.60 H v.2","ZA 00.80 H v.2","ZA 00.60 H v.2","ZA 00.80 H v.2","ZA 00.60 H v.2"]
["PAGE2","Sokol_bok_3",{"$f":"IFERROR(INDEX(M38:BJ38,1,$A$5),\"пусто\")","v":"пусто"},{"$f":"CONCATENATE(C38,\" \",INDEX(Наименования!B:B,MATCH(MPx_Add!C38,Наименования!A:A,0)))","v":"пусто "},null,{"$f":"IFERROR(CONCATENATE(C38,\" \",INDEX(Наименования!B:B,MATCH(C38,Наименования!A:A,0))),\"пусто\")","v":"пусто "},null,null,null,null,1,"Цоколь бок 100 щет.ввод","ZA 00.60 K v.2","ZA 00.40 K v.2","ZA 00.60 K v.2","ZA 00.60 K v.2","ZA 00.40 K v.2","0-","ZA 00.60 K v.2","ZA 00.80 K v.2","ZA 00.40 K v.2","0-","ZA 00.60 K v.2","0-","ZA 00.60 K v.2","ZA 00.40 K v.2","0-","ZA 00.60 K v.2","ZA 00.40 K v.2","0-","ZA 00.60 K v.2","0-","ZA 00.60 K v.2","ZA 00.40 K v.2","0-","ZA 00.60 K v.2","ZA 00.80 K v.2","ZA 00.40 K v.2","0-","ZA 00.60 K v.2","ZA 00.80 K v.2","ZA 00.60 K v.2","ZA 00.80 K v.2","ZA 00.40 K v.2","ZA 00.60 K v.2","ZA 00.80 K v.2","0-","ZA 00.40 K v.2","ZA 00.40 K v.2","0-","ZA 00.60 K v.2","ZA 00.40 K v.2","0-","ZA 00.60 K v.2","ZA 00.80 K v.2","ZA 00.40 K v.2","0-","ZA 00.60 K v.2","ZA 00.80 K v.2","ZA 00.60 K v.2","ZA 00.80 K v.2","ZA 00.60 K v.2"]
["PAGE2","Sokol_bok_4",{"$f":"IFERROR(INDEX(M39:BJ39,1,$A$5),\"пусто\")","v":"пусто"},"Нет",null,null,null,null,null,null,1,"нет","Нет","Нет","Нет","Нет","Нет","Нет","Нет","Нет","Нет","Нет","Нет","Нет","Нет","Нет","Нет","Нет","Нет","Нет","Нет","Нет","Нет","Нет","Нет","Нет","Нет","Нет","Нет","Нет","Нет","Нет","Нет","Нет","Нет","Нет","Нет","Нет","Нет","Нет","Нет","Нет","Нет","Нет","Нет","Нет","Нет","Нет","Нет","Нет","Нет","Нет"]
["PAGE2","CheckBox10",{"$f":"IFERROR(INDEX(C41:C44,G40),\"пусто\")","v":"пусто"},null,null,null,null,null,null,null,1,"Доп. варианты основания"]
["PAGE2","Nogi_1","F 12.40",{"$f":"CONCATENATE(C41,\" \",INDEX(Наименования!B:B,MATCH(MPx_Add!C41,Наименования!A:A,0)))","v":"F 12.40 Регулировочные ножки 40мм шкафов MPx 4шт"},null,{"$f":"IFERROR(CONCATENATE(C41,\" \",INDEX(Наименования!B:B,MATCH(C41,Наименования!A:A,0))),\"пусто\")","v":"F 12.40 Регулировочные ножки 40мм шкафов MPx 4шт"},false,null,null,{"$f":"IF(AND(G41,$I$40),C41,\"\")","v":""},1,"Винтовые опоры","F 12.40","F 12.40","F 12.40","F 12.40","F 12.40","F 12.40","F 12.40","F 12.40","F 12.40","F 12.40","F 12.40","F 12.40","F 12.40","F 12.40","F 12.40","F 12.40","F 12.40","F 12.40","F 12.40","F 12.40","F 12.40","F 12.40","F 12.40","F 12.40","F 12.40","F 12.40","F 12.40","F 12.40","F 12.40","F 12.40","F 12.40","F 12.40","F 12.40","F 12.40","F 12.40","F 12.40","F 12.40","F 12.40","F 12.40","F 12.40","F 12.40","F 12.40","F 12.40","F 12.40","F 12.40","F 12.40","F 12.40","F 12.40","F 12.40","F 12.40"]
["PAGE2","Nogi_2_1","C 12.125","C 12.125 + C12.125 T Ролик поворотный MPx транспортировочный 2шт + 2шт с фиксатором ",null,{"$f":"IFERROR(CONCATENATE(C42,\" \",INDEX(Наименования!B:B,MATCH(C42,Наименования!A:A,0))),\"пусто\")","v":"C 12.125 Ролик поворотный MPx транспортировочный без фиксатора 2шт"},true,null,null,{"$f":"IF(AND(G42,$I$40),C42,\"\")","v":"C 12.125"},1,"Ролики 2торм.","C 12.125 T","C 12.125 T","C 12.125 T","C 12.125 T","C 12.125 T","C 12.125 T","C 12.125 T","C 12.125 T","C 12.125 T","C 12.125 T","C 12.125 T","C 12.125 T","C 12.125 T","C 12.125 T","C 12.125 T","C 12.125 T","C 12.125 T","C 12.125 T","C 12.125 T","C 12.125 T","C 12.125 T","C 12.125 T","C 12.125 T","C 12.125 T","C 12.125 T","C 12.125 T","C 12.125 T","C 12.125 T","C 12.125 T","C 12.125 T","C 12.125 T","C 12.125 T","C 12.125 T","C 12.125 T","C 12.125 T","C 12.125 T","C 12.125 T","C 12.125 T","C 12.125 T","C 12.125 T","C 12.125 T","C 12.125 T","C 12.125 T","C 12.125 T","C 12.125 T","C 12.125 T","C 12.125 T","C 12.125 T","C 12.125 T","C 12.125 T"]
["PAGE2","Nogi_2_2","C 12.125 T","0-",null,{"$f":"IFERROR(CONCATENATE(C43,\" \",INDEX(Наименования!B:B,MATCH(C43,Наименования!A:A,0))),\"пусто\")","v":"C 12.125 T Ролик поворотный MPx транспортировочный с фиксатором 2шт"},true,null,null,"C 12.125 T",1,"Ролики 2 без торм.","C 12.125","C 12.125","C 12.125","C 12.125","C 12.125","C 12.125","C 12.125","C 12.125","C 12.125","C 12.125","C 12.125","C 12.125","C 12.125","C 12.125","C 12.125","C 12.125","C 12.125","C 12.125","C 12.125","C 12.125","C 12.125","C 12.125","C 12.125","C 12.125","C 12.125","C 12.125","C 12.125","C 12.125","C 12.125","C 12.125","C 12.125","C 12.125","C 12.125","C 12.125","C 12.125","C 12.125","C 12.125","C 12.125","C 12.125","C 12.125","C 12.125","C 12.125","C 12.125","C 12.125","C 12.125","C 12.125","C 12.125","C 12.125","C 12.125","C 12.125"]
["PAGE2","Nogi_3",{"$f":"IFERROR(INDEX(M44:BJ44,1,$A$5),\"пусто\")","v":"пусто"},"Нет",null,null,false,null,null,null,1,"нет","Нет","Нет","Нет","Нет","Нет","Нет","Нет","Нет","Нет","Нет","Нет","Нет","Нет","Нет","Нет","Нет","Нет","Нет","Нет","Нет","Нет","Нет","Нет","Нет","Нет","Нет","Нет","Нет","Нет","Нет","Нет","Нет","Нет","Нет","Нет","Нет","Нет","Нет","Нет","Нет","Нет","Нет","Нет","Нет","Нет","Нет","Нет","Нет","Нет","Нет"]
["PAGE2","CheckBox11",{"$f":"IFERROR(INDEX(C46:C49,G45),\"пусто\")","v":"пусто"},null,null,null,{"$f":"MATCH(E46,D46:D49,0)","v":{"$error":"#N/A"}},null,null,{"$f":"IFERROR(IF(I45,C45,\"\"),\"\")","v":""},1,"Панели кабельного ввода"]
["PAGE2","Vvod_1",{"$f":"IFERROR(INDEX(M46:BJ46,1,$A$5),\"пусто\")","v":"пусто"},{"$f":"CONCATENATE(C46,\" \",INDEX(Наименования!B:B,MATCH(MPx_Add!C46,Наименования!A:A,0)))","v":"пусто "},"PK 62.08 P Панель MPx Ш=800мм кабельного ввода с вырезами 2шт",{"$f":"IFERROR(CONCATENATE(C46,\" \",INDEX(Наименования!B:B,MATCH(C46,Наименования!A:A,0))),\"пусто\")","v":"пусто "},false,null,null,null,1,"Панели с вырезом","PK 42.08 P","PK 62.08 P","PK 62.08 P","PK 42.08 P","PK 42.08 P","PK 42.08 P","PK 42.08 P","PK 42.08 P","PK 62.08 P","PK 62.08 P","PK 62.08 P","0-","0-","PK 42.08 P","PK 42.08 P","PK 42.08 P","PK 62.08 P","PK 62.08 P","PK 62.08 P","0-","0-","PK 42.08 P","PK 42.08 P","PK 42.08 P","PK 42.08 P","PK 62.08 P","PK 62.08 P","PK 62.08 P","PK 62.08 P","PK 42.08 P","PK 42.08 P","PK 62.08 P","PK 62.08 P","PK 62.08 P","PK 62.08 P","PK 32.08 P","PK 42.08 P","PK 42.08 P","PK 42.08 P","PK 32.08 P","PK 32.08 P","PK 32.08 P","PK 32.08 P","PK 42.08 P","PK 42.08 P","PK 42.08 P","PK 42.08 P","PK 32.08 P","PK 32.08 P","PK 42.08 P"]
["PAGE2","Vvod_2","пусто",{"$f":"CONCATENATE(C47,\" \",INDEX(Наименования!B:B,MATCH(MPx_Add!C47,Наименования!A:A,0)))","v":"пусто "},null,{"$f":"IFERROR(CONCATENATE(C47,\" \",INDEX(Наименования!B:B,MATCH(C47,Наименования!A:A,0))),\"пусто\")","v":"пусто "},false,null,null,null,1,"Щеточный угловой","G 60.4 B","G 80.4 B","G 80.4 B","G 60.4 B","G 60.4 B","G 60.4 B","G 60.4 B","G 60.4 B","G 80.4 B","G 80.4 B","G 80.4 B","0-","0-","G 60.4 B","G 60.4 B","G 60.4 B","G 80.4 B","G 80.4 B","G 80.4 B","0-","0-","G 60.4 B","G 60.4 B","G 60.4 B","G 60.4 B","G 80.4 B","G 80.4 B","G 80.4 B","G 80.4 B","G 60.4 B","G 60.4 B","G 80.4 B","G 80.4 B","G 80.4 B","G 80.4 B","G 50.4 B","G 60.4 B","G 60.4 B","G 60.4 B","G 50.4 B","G 50.4 B","G 50.4 B","G 50.4 B","G 60.4 B","G 60.4 B","G 60.4 B","G 60.4 B","G 50.4 B","G 50.4 B","G 60.4 B"]
["PAGE2","Vvod_3","пусто",{"$f":"CONCATENATE(C48,\" \",INDEX(Наименования!B:B,MATCH(MPx_Add!C48,Наименования!A:A,0)))","v":"пусто "},null,{"$f":"IFERROR(CONCATENATE(C48,\" \",INDEX(Наименования!B:B,MATCH(C48,Наименования!A:A,0))),\"пусто\")","v":"пусто "},false,null,null,null,1,"Щеточный плоский","G 35.3 B","G 48.3 B","G 48.3 B","G 35.3 B","G 35.3 B","G 35.3 B","G 35.3 B","G 35.3 B","G 48.3 B","G 48.3 B","G 48.3 B","0-","0-","G 35.3 B","G 35.3 B","G 35.3 B","G 48.3 B","G 48.3 B","G 48.3 B","0-","0-","G 35.3 B","G 35.3 B","G 35.3 B","G 35.3 B","G 48.3 B","G 48.3 B","G 48.3 B","G 48.3 B","G 35.3 B","G 35.3 B","G 48.3 B","G 48.3 B","G 48.3 B","G 48.3 B","G 68.3 B","G 35.3 B","G 35.3 B","G 35.3 B","G 68.3 B","G 68.3 B","G 68.3 B","G 68.3 B","G 35.3 B","G 35.3 B","G 35.3 B","G 35.3 B","G 68.3 B","G 68.3 B","G 35.3 B"]
["PAGE2","Vvod_4","пусто","Нет",null,null,false,null,null,null,1,"нет","Нет","Нет","Нет","Нет","Нет","Нет","Нет","Нет","Нет","Нет","Нет","Нет","Нет","Нет","Нет","Нет","Нет","Нет","Нет","Нет","Нет","Нет","Нет","Нет","Нет","Нет","Нет","Нет","Нет","Нет","Нет","Нет","Нет","Нет","Нет","Нет","Нет","Нет","Нет","Нет","Нет","Нет","Нет","Нет","Нет","Нет","Нет","Нет","Нет","Нет"]
["PAGE2","CheckBox12","пусто",null,{"$f":"F50","v":"пусто "},{"$f":"IFERROR(CONCATENATE(C50,\" \",INDEX(Наименования!B:B,MATCH(C50,Наименования!A:A,0))),\"пусто\")","v":"пусто "},null,null,null,{"$f":"IFERROR(IF(I50,C50,\"\"),\"\")","v":""},1,"Ввод 13мм","GK 13.8","GK 13.8","GK 13.8","GK 13.8","GK 13.8","GK 13.8","GK 13.8","GK 13.8","GK 13.8","GK 13.8","GK 13.8","GK 13.8","GK 13.8","GK 13.8","GK 13.8","GK 13.8","GK 13.8","GK 13.8","GK 13.8","GK 13.8","GK 13.8","GK 13.8","GK 13.8","GK 13.8","GK 13.8","GK 13.8","GK 13.8","GK 13.8","GK 13.8","GK 13.8","GK 13.8","GK 13.8","GK 13.8","GK 13.8","GK 13.8","GK 13.8","GK 13.8","GK 13.8","GK 13.8","GK 13.8","GK 13.8","GK 13.8","GK 13.8","GK 13.8","GK 13.8","GK 13.8","GK 13.8","GK 13.8","GK 13.8","GK 13.8"]
["PAGE2","CheckBox15","пусто",null,{"$f":"F51","v":"пусто "},{"$f":"IFERROR(CONCATENATE(C51,\" \",INDEX(Наименования!B:B,MATCH(C51,Наименования!A:A,0))),\"пусто\")","v":"пусто "},null,null,null,{"$f":"IFERROR(IF(I51,C51,\"\"),\"\")","v":""},1,"Ввод 21мм","GK 21.3","GK 21.3","GK 21.3","GK 21.3","GK 21.3","GK 21.3","GK 21.3","GK 21.3","GK 21.3","GK 21.3","GK 21.3","GK 21.3","GK 21.3","GK 21.3","GK 21.3","GK 21.3","GK 21.3","GK 21.3","GK 21.3","GK 21.3","GK 21.3","GK 21.3","GK 21.3","GK 21.3","GK 21.3","GK 21.3","GK 21.3","GK 21.3","GK 21.3","GK 21.3","GK 21.3","GK 21.3","GK 21.3","GK 21.3","GK 21.3","GK 21.3","GK 21.3","GK 21.3","GK 21.3","GK 21.3","GK 21.3","GK 21.3","GK 21.3","GK 21.3","GK 21.3","GK 21.3","GK 21.3","GK 21.3","GK 21.3","GK 21.3"]
["PAGE2","CheckBox16","пусто",null,{"$f":"F52","v":"пусто "},{"$f":"IFERROR(CONCATENATE(C52,\" \",INDEX(Наименования!B:B,MATCH(C52,Наименования!A:A,0))),\"пусто\")","v":"пусто "},null,null,null,{"$f":"IFERROR(IF(I52,C52,\"\"),\"\")","v":""},1,"Ввод 47мм","GK 47.1","GK 47.1","GK 47.1","GK 47.1","GK 47.1","GK 47.1","GK 47.1","GK 47.1","GK 47.1","GK 47.1","GK 47.1","GK 47.1","GK 47.1","GK 47.1","GK 47.1","GK 47.1","GK 47.1","GK 47.1","GK 47.1","GK 47.1","GK 47.1","GK 47.1","GK 47.1","GK 47.1","GK 47.1","GK 47.1","GK 47.1","GK 47.1","GK 47.1","GK 47.1","GK 47.1","GK 47.1","GK 47.1","GK 47.1","GK 47.1","GK 47.1","GK 47.1","GK 47.1","GK 47.1","GK 47.1","GK 47.1","GK 47.1","GK 47.1","GK 47.1","GK 47.1","GK 47.1","GK 47.1","GK 47.1","GK 47.1","GK 47.1"]
["PAGE2","CheckBox26",{"$f":"IFERROR(INDEX(C54:C57,G53),\"пусто\")","v":"пусто"},null,null,null,{"$f":"MATCH(E54,D54:D57,0)","v":{"$error":"#N/A"}},null,null,{"$f":"IFERROR(IF(I53,C53,\"\"),\"\")","v":""},1,"Траверса для фикс. б/ЭМС"]
["PAGE2","ComboBox8_1",{"$f":"IFERROR(INDEX(M54:BJ54,1,$A$5),\"пусто\")","v":"пусто"},{"$f":"CONCATENATE(C54,\" \",INDEX(Наименования!B:B,MATCH(MPx_Add!C54,Наименования!A:A,0)))","v":"пусто "},"MG 80.04 C Монтажная траверса внутренний уровень MPx 800мм 4шт",null,false,null,null,null,1,"Каб. Гребенка","MG 60","MG 80","MG 80","MG 60","MG 60","MG 60","MG 60","MG 60","MG 80","MG 80","MG 80","MG 40","MG 40","MG 60","MG 60","MG 60","MG 80","MG 80","MG 80","MG 40","MG 40","MG 60","MG 60","MG 60","MG 60","MG 80","MG 80","MG 80","MG 80","MG 60","MG 60","MG 80","MG 80","MG 80","MG 80","MG 100","0-","0-","0-","MG 100","MG 100","MG 100","MG 100","0-","0-","0-","0-","MG 100","MG 100","0-"]
["PAGE2","ComboBox8_2",{"$f":"IFERROR(INDEX(M55:BJ55,1,$A$5),\"пусто\")","v":"пусто"},{"$f":"CONCATENATE(C55,\" \",INDEX(Наименования!B:B,MATCH(MPx_Add!C55,Наименования!A:A,0)))","v":"пусто "},null,null,false,null,null,null,1,"Монт.Траверса внутр.уровень","MG 60.04 C","MG 80.04 C","MG 80.04 C","MG 60.04 C","MG 60.04 C","MG 60.04 C","MG 60.04 C","MG 60.04 C","MG 80.04 C","MG 80.04 C","MG 80.04 C","MG 40.04 C","MG 40.04 C","MG 60.04 C","MG 60.04 C","MG 60.04 C","MG 80.04 C","MG 80.04 C","MG 80.04 C","MG 40.04 C","MG 40.04 C","MG 60.04 C","MG 60.04 C","MG 60.04 C","MG 60.04 C","MG 80.04 C","MG 80.04 C","MG 80.04 C","MG 80.04 C","MG 60.04 C","MG 60.04 C","MG 80.04 C","MG 80.04 C","MG 80.04 C","MG 80.04 C","MG 100.04 C","MG 120.04 C","MG 120.04 C","MG 120.04 C","MG 100.04 C","MG 100.04 C","MG 100.04 C","MG 100.04 C","MG 120.04 C","MG 120.04 C","MG 120.04 C","MG 120.04 C","MG 100.04 C","MG 100.04 C","MG 120.04 C"]
["PAGE2","ComboBox8_3",{"$f":"IFERROR(INDEX(M56:BJ56,1,$A$5),\"пусто\")","v":"пусто"},{"$f":"CONCATENATE(C56,\" \",INDEX(Наименования!B:B,MATCH(MPx_Add!C56,Наименования!A:A,0)))","v":"пусто "},null,null,false,null,null,null,1,"Монт.Траверса внеш.урровень","MG 60.04 CL","MG 80.04 CL","MG 80.04 CL","MG 60.04 CL","MG 60.04 CL","MG 60.04 CL","MG 60.04 CL","MG 60.04 CL","MG 80.04 CL","MG 80.04 CL","MG 80.04 CL","MG 40.04 CL","MG 40.04 CL","MG 60.04 CL","MG 60.04 CL","MG 60.04 CL","MG 80.04 CL","MG 80.04 CL","MG 80.04 CL","MG 40.04 CL","MG 40.04 CL","MG 60.04 CL","MG 60.04 CL","MG 60.04 CL","MG 60.04 CL","MG 80.04 CL","MG 80.04 CL","MG 80.04 CL","MG 80.04 CL","MG 60.04 CL","MG 60.04 CL","MG 80.04 CL","MG 80.04 CL","MG 80.04 CL","MG 80.04 CL","MG 100.04 CL","0-","0-","0-","MG 100.04 CL","MG 100.04 CL","MG 100.04 CL","MG 100.04 CL","0-","0-","0-","0-","MG 100.04 CL","MG 100.04 CL","0-"]
["PAGE2","ComboBox8_4",{"$f":"IFERROR(INDEX(M57:BJ57,1,$A$5),\"пусто\")","v":"пусто"},"Нет",null,null,false,null,null,null,1,"нет","Нет","Нет","Нет","Нет","Нет","Нет","Нет","Нет","Нет","Нет","Нет","Нет","Нет","Нет","Нет","Нет","Нет","Нет","Нет","Нет","Нет","Нет","Нет","Нет","Нет","Нет","Нет","Нет","Нет","Нет","Нет","Нет","Нет","Нет","Нет","Нет","Нет","Нет","Нет","Нет","Нет","Нет","Нет","Нет","Нет","Нет","Нет","Нет","Нет","Нет"]
["PAGE2","CheckBox21",{"$f":"IFERROR(INDEX(M58:BJ58,1,$A$5),\"пусто\")","v":"пусто"},null,{"$f":"F58","v":"пусто "},{"$f":"IFERROR(CONCATENATE(C58,\" \",INDEX(Наименования!B:B,MATCH(C58,Наименования!A:A,0))),\"пусто\")","v":"пусто "},null,null,null,{"$f":"IFERROR(IF(I58,C58,\"\"),\"\")","v":""},1,"Держатель траверсы","B 8 MG","B 8 MG","B 8 MG","B 8 MG","B 8 MG","B 8 MG","B 8 MG","B 8 MG","B 8 MG","B 8 MG","B 8 MG","B 8 MG","B 8 MG","B 8 MG","B 8 MG","B 8 MG","B 8 MG","B 8 MG","B 8 MG","B 8 MG","B 8 MG","B 8 MG","B 8 MG","B 8 MG","B 8 MG","B 8 MG","B 8 MG","B 8 MG","B 8 MG","B 8 MG","B 8 MG","B 8 MG","B 8 MG","B 8 MG","B 8 MG","B 8 MG","B 8 MG","B 8 MG","B 8 MG","B 8 MG","B 8 MG","B 8 MG","B 8 MG","B 8 MG","B 8 MG","B 8 MG","B 8 MG","B 8 MG","B 8 MG","B 8 MG"]
["PAGE2","CheckBox22",{"$f":"IFERROR(INDEX(C60:C68,G59),\"пусто\")","v":"пусто"},null,null,null,{"$f":"MATCH(E60,D60:D68,0)","v":{"$error":"#N/A"}},null,null,{"$f":"IFERROR(IF(I59,C59,\"\"),\"\")","v":""},1,"Каб.зажимы для С-траверсы_в1"]
["PAGE2","ComboBox4_1",{"$f":"IFERROR(INDEX(M60:BJ60,1,$A$5),\"пусто\")","v":"пусто"},{"$f":"CONCATENATE(C60,\" \",INDEX(Наименования!B:B,MATCH(MPx_Add!C60,Наименования!A:A,0)))","v":"пусто "},"CL 38 Кабельные зажимы 30-38мм С-образных монтажных траверс 25шт",null,false,null,null,null,1,"зажимы 6-12мм С-траверс","CL 12","CL 12","CL 12","CL 12","CL 12","CL 12","CL 12","CL 12","CL 12","CL 12","CL 12","CL 12","CL 12","CL 12","CL 12","CL 12","CL 12","CL 12","CL 12","CL 12","CL 12","CL 12","CL 12","CL 12","CL 12","CL 12","CL 12","CL 12","CL 12","CL 12","CL 12","CL 12","CL 12","CL 12","CL 12","CL 12","CL 12","CL 12","CL 12","CL 12","CL 12","CL 12","CL 12","CL 12","CL 12","CL 12","CL 12","CL 12","CL 12","CL 12"]
["PAGE2","ComboBox4_2","пусто",{"$f":"CONCATENATE(C61,\" \",INDEX(Наименования!B:B,MATCH(MPx_Add!C61,Наименования!A:A,0)))","v":"пусто "},null,null,false,null,null,null,1,"зажимы 12-18мм С-траверс","CL 18","CL 18","CL 18","CL 18","CL 18","CL 18","CL 18","CL 18","CL 18","CL 18","CL 18","CL 18","CL 18","CL 18","CL 18","CL 18","CL 18","CL 18","CL 18","CL 18","CL 18","CL 18","CL 18","CL 18","CL 18","CL 18","CL 18","CL 18","CL 18","CL 18","CL 18","CL 18","CL 18","CL 18","CL 18","CL 18","CL 18","CL 18","CL 18","CL 18","CL 18","CL 18","CL 18","CL 18","CL 18","CL 18","CL 18","CL 18","CL 18","CL 18"]
["PAGE2","ComboBox4_3","пусто",{"$f":"CONCATENATE(C62,\" \",INDEX(Наименования!B:B,MATCH(MPx_Add!C62,Наименования!A:A,0)))","v":"пусто "},null,null,false,null,null,null,1,"зажимы 18-22мм С-траверс","CL 22","CL 22","CL 22","CL 22","CL 22","CL 22","CL 22","CL 22","CL 22","CL 22","CL 22","CL 22","CL 22","CL 22","CL 22","CL 22","CL 22","CL 22","CL 22","CL 22","CL 22","CL 22","CL 22","CL 22","CL 22","CL 22","CL 22","CL 22","CL 22","CL 22","CL 22","CL 22","CL 22","CL 22","CL 22","CL 22","CL 22","CL 22","CL 22","CL 22","CL 22","CL 22","CL 22","CL 22","CL 22","CL 22","CL 22","CL 22","CL 22","CL 22"]
["PAGE2","ComboBox4_4","пусто",{"$f":"CONCATENATE(C63,\" \",INDEX(Наименования!B:B,MATCH(MPx_Add!C63,Наименования!A:A,0)))","v":"пусто "},null,null,false,null,null,null,1,"зажимы 22-30мм С-траверс","CL 30","CL 30","CL 30","CL 30","CL 30","CL 30","CL 30","CL 30","CL 30","CL 30","CL 30","CL 30","CL 30","CL 30","CL 30","CL 30","CL 30","CL 30","CL 30","CL 30","CL 30","CL 30","CL 30","CL 30","CL 30","CL 30","CL 30","CL 30","CL 30","CL 30","CL 30","CL 30","CL 30","CL 30","CL 30","CL 30","CL 30","CL 30","CL 30","CL 30","CL 30","CL 30","CL 30","CL 30","CL 30","CL 30","CL 30","CL 30","CL 30","CL 30"]
["PAGE2","ComboBox4_5","пусто",{"$f":"CONCATENATE(C64,\" \",INDEX(Наименования!B:B,MATCH(MPx_Add!C64,Наименования!A:A,0)))","v":"пусто "},null,null,false,null,null,null,1,"зажимы 30-38мм С-траверс","CL 38","CL 38","CL 38","CL 38","CL 38","CL 38","CL 38","CL 38","CL 38","CL 38","CL 38","CL 38","CL 38","CL 38","CL 38","CL 38","CL 38","CL 38","CL 38","CL 38","CL 38","CL 38","CL 38","CL 38","CL 38","CL 38","CL 38","CL 38","CL 38","CL 38","CL 38","CL 38","CL 38","CL 38","CL 38","CL 38","CL 38","CL 38","CL 38","CL 38","CL 38","CL 38","CL 38","CL 38","CL 38","CL 38","CL 38","CL 38","CL 38","CL 38"]
["PAGE2","ComboBox4_6","пусто",{"$f":"CONCATENATE(C65,\" \",INDEX(Наименования!B:B,MATCH(MPx_Add!C65,Наименования!A:A,0)))","v":"пусто "},null,null,true,null,null,null,1,"зажимы 38-42мм С-траверс","CL 42","CL 42","CL 42","CL 42","CL 42","CL 42","CL 42","CL 42","CL 42","CL 42","CL 42","CL 42","CL 42","CL 42","CL 42","CL 42","CL 42","CL 42","CL 42","CL 42","CL 42","CL 42","CL 42","CL 42","CL 42","CL 42","CL 42","CL 42","CL 42","CL 42","CL 42","CL 42","CL 42","CL 42","CL 42","CL 42","CL 42","CL 42","CL 42","CL 42","CL 42","CL 42","CL 42","CL 42","CL 42","CL 42","CL 42","CL 42","CL 42","CL 42"]
["PAGE2","ComboBox4_7","пусто",{"$f":"CONCATENATE(C66,\" \",INDEX(Наименования!B:B,MATCH(MPx_Add!C66,Наименования!A:A,0)))","v":"пусто "},null,null,false,null,null,null,1,"зажимы 42-50мм С-траверс","CL 50","CL 50","CL 50","CL 50","CL 50","CL 50","CL 50","CL 50","CL 50","CL 50","CL 50","CL 50","CL 50","CL 50","CL 50","CL 50","CL 50","CL 50","CL 50","CL 50","CL 50","CL 50","CL 50","CL 50","CL 50","CL 50","CL 50","CL 50","CL 50","CL 50","CL 50","CL 50","CL 50","CL 50","CL 50","CL 50","CL 50","CL 50","CL 50","CL 50","CL 50","CL 50","CL 50","CL 50","CL 50","CL 50","CL 50","CL 50","CL 50","CL 50"]
["PAGE2","ComboBox4_8","пусто",{"$f":"CONCATENATE(C67,\" \",INDEX(Наименования!B:B,MATCH(MPx_Add!C67,Наименования!A:A,0)))","v":"пусто "},null,null,false,null,null,null,1,"зажимы 50-64мм С-траверс","CL 64","CL 64","CL 64","CL 64","CL 64","CL 64","CL 64","CL 64","CL 64","CL 64","CL 64","CL 64","CL 64","CL 64","CL 64","CL 64","CL 64","CL 64","CL 64","CL 64","CL 64","CL 64","CL 64","CL 64","CL 64","CL 64","CL 64","CL 64","CL 64","CL 64","CL 64","CL 64","CL 64","CL 64","CL 64","CL 64","CL 64","CL 64","CL 64","CL 64","CL 64","CL 64","CL 64","CL 64","CL 64","CL 64","CL 64","CL 64","CL 64","CL 64"]
["PAGE2","ComboBox4_9","пусто","Нет",null,null,false,null,null,null,1,"нет","Нет","Нет","Нет","Нет","Нет","Нет","Нет","Нет","Нет","Нет","Нет","Нет","Нет","Нет","Нет","Нет","Нет","Нет","Нет","Нет","Нет","Нет","Нет","Нет","Нет","Нет","Нет","Нет","Нет","Нет","Нет","Нет","Нет","Нет","Нет","Нет","Нет","Нет","Нет","Нет","Нет","Нет","Нет","Нет","Нет","Нет","Нет","Нет","Нет","Нет"]
["PAGE2","CheckBox23",{"$f":"IFERROR(INDEX(C70:C78,G69),\"пусто\")","v":"пусто"},null,null,null,{"$f":"MATCH(E70,D70:D78,0)","v":{"$error":"#N/A"}},null,null,{"$f":"IFERROR(IF(I69,C69,\"\"),\"\")","v":""},1,"Каб.зажимы для С-траверсы_в2"]
["PAGE2","ComboBox5_1",{"$f":"IFERROR(INDEX(M70:BJ70,1,$A$5),\"пусто\")","v":"пусто"},{"$f":"CONCATENATE(C70,\" \",INDEX(Наименования!B:B,MATCH(MPx_Add!C70,Наименования!A:A,0)))","v":"пусто "},"CL 30 Кабельные зажимы 22-30мм С-образных монтажных траверс 25шт",null,false,null,null,null,1,"зажимы 6-12мм С-траверс","CL 12","CL 12","CL 12","CL 12","CL 12","CL 12","CL 12","CL 12","CL 12","CL 12","CL 12","CL 12","CL 12","CL 12","CL 12","CL 12","CL 12","CL 12","CL 12","CL 12","CL 12","CL 12","CL 12","CL 12","CL 12","CL 12","CL 12","CL 12","CL 12","CL 12","CL 12","CL 12","CL 12","CL 12","CL 12","CL 12","CL 12","CL 12","CL 12","CL 12","CL 12","CL 12","CL 12","CL 12","CL 12","CL 12","CL 12","CL 12","CL 12","CL 12"]
["PAGE2","ComboBox5_2","пусто",{"$f":"CONCATENATE(C71,\" \",INDEX(Наименования!B:B,MATCH(MPx_Add!C71,Наименования!A:A,0)))","v":"пусто "},null,null,false,null,null,null,1,"зажимы 12-18мм С-траверс","CL 18","CL 18","CL 18","CL 18","CL 18","CL 18","CL 18","CL 18","CL 18","CL 18","CL 18","CL 18","CL 18","CL 18","CL 18","CL 18","CL 18","CL 18","CL 18","CL 18","CL 18","CL 18","CL 18","CL 18","CL 18","CL 18","CL 18","CL 18","CL 18","CL 18","CL 18","CL 18","CL 18","CL 18","CL 18","CL 18","CL 18","CL 18","CL 18","CL 18","CL 18","CL 18","CL 18","CL 18","CL 18","CL 18","CL 18","CL 18","CL 18","CL 18"]
["PAGE2","ComboBox5_3","пусто",{"$f":"CONCATENATE(C72,\" \",INDEX(Наименования!B:B,MATCH(MPx_Add!C72,Наименования!A:A,0)))","v":"пусто "},null,null,false,null,null,null,1,"зажимы 18-22мм С-траверс","CL 22","CL 22","CL 22","CL 22","CL 22","CL 22","CL 22","CL 22","CL 22","CL 22","CL 22","CL 22","CL 22","CL 22","CL 22","CL 22","CL 22","CL 22","CL 22","CL 22","CL 22","CL 22","CL 22","CL 22","CL 22","CL 22","CL 22","CL 22","CL 22","CL 22","CL 22","CL 22","CL 22","CL 22","CL 22","CL 22","CL 22","CL 22","CL 22","CL 22","CL 22","CL 22","CL 22","CL 22","CL 22","CL 22","CL 22","CL 22","CL 22","CL 22"]
["PAGE2","ComboBox5_5","пусто",{"$f":"CONCATENATE(C73,\" \",INDEX(Наименования!B:B,MATCH(MPx_Add!C73,Наименования!A:A,0)))","v":"пусто "},null,null,false,null,null,null,1,"зажимы 22-30мм С-траверс","CL 30","CL 30","CL 30","CL 30","CL 30","CL 30","CL 30","CL 30","CL 30","CL 30","CL 30","CL 30","CL 30","CL 30","CL 30","CL 30","CL 30","CL 30","CL 30","CL 30","CL 30","CL 30","CL 30","CL 30","CL 30","CL 30","CL 30","CL 30","CL 30","CL 30","CL 30","CL 30","CL 30","CL 30","CL 30","CL 30","CL 30","CL 30","CL 30","CL 30","CL 30","CL 30","CL 30","CL 30","CL 30","CL 30","CL 30","CL 30","CL 30","CL 30"]
["PAGE2","ComboBox5_5","пусто",{"$f":"CONCATENATE(C74,\" \",INDEX(Наименования!B:B,MATCH(MPx_Add!C74,Наименования!A:A,0)))","v":"пусто "},null,null,false,null,null,null,1,"зажимы 30-38мм С-траверс","CL 38","CL 38","CL 38","CL 38","CL 38","CL 38","CL 38","CL 38","CL 38","CL 38","CL 38","CL 38","CL 38","CL 38","CL 38","CL 38","CL 38","CL 38","CL 38","CL 38","CL 38","CL 38","CL 38","CL 38","CL 38","CL 38","CL 38","CL 38","CL 38","CL 38","CL 38","CL 38","CL 38","CL 38","CL 38","CL 38","CL 38","CL 38","CL 38","CL 38","CL 38","CL 38","CL 38","CL 38","CL 38","CL 38","CL 38","CL 38","CL 38","CL 38"]
["PAGE2","ComboBox5_6","пусто",{"$f":"CONCATENATE(C75,\" \",INDEX(Наименования!B:B,MATCH(MPx_Add!C75,Наименования!A:A,0)))","v":"пусто "},null,null,false,null,null,null,1,"зажимы 38-42мм С-траверс","CL 42","CL 42","CL 42","CL 42","CL 42","CL 42","CL 42","CL 42","CL 42","CL 42","CL 42","CL 42","CL 42","CL 42","CL 42","CL 42","CL 42","CL 42","CL 42","CL 42","CL 42","CL 42","CL 42","CL 42","CL 42","CL 42","CL 42","CL 42","CL 42","CL 42","CL 42","CL 42","CL 42","CL 42","CL 42","CL 42","CL 42","CL 42","CL 42","CL 42","CL 42","CL 42","CL 42","CL 42","CL 42","CL 42","CL 42","CL 42","CL 42","CL 42"]
["PAGE2","ComboBox5_7","пусто",{"$f":"CONCATENATE(C76,\" \",INDEX(Наименования!B:B,MATCH(MPx_Add!C76,Наименования!A:A,0)))","v":"пусто "},null,null,false,null,null,null,1,"зажимы 42-50мм С-траверс","CL 50","CL 50","CL 50","CL 50","CL 50","CL 50","CL 50","CL 50","CL 50","CL 50","CL 50","CL 50","CL 50","CL 50","CL 50","CL 50","CL 50","CL 50","CL 50","CL 50","CL 50","CL 50","CL 50","CL 50","CL 50","CL 50","CL 50","CL 50","CL 50","CL 50","CL 50","CL 50","CL 50","CL 50","CL 50","CL 50","CL 50","CL 50","CL 50","CL 50","CL 50","CL 50","CL 50","CL 50","CL 50","CL 50","CL 50","CL 50","CL 50","CL 50"]
["PAGE2","ComboBox5_8","пусто",{"$f":"CONCATENATE(C77,\" \",INDEX(Наименования!B:B,MATCH(MPx_Add!C77,Наименования!A:A,0)))","v":"пусто "},null,null,false,null,null,null,1,"зажимы 50-64мм С-траверс","CL 64","CL 64","CL 64","CL 64","CL 64","CL 64","CL 64","CL 64","CL 64","CL 64","CL 64","CL 64","CL 64","CL 64","CL 64","CL 64","CL 64","CL 64","CL 64","CL 64","CL 64","CL 64","CL 64","CL 64","CL 64","CL 64","CL 64","CL 64","CL 64","CL 64","CL 64","CL 64","CL 64","CL 64","CL 64","CL 64","CL 64","CL 64","CL 64","CL 64","CL 64","CL 64","CL 64","CL 64","CL 64","CL 64","CL 64","CL 64","CL 64","CL 64"]
["PAGE2","ComboBox5_9","пусто","Нет",null,null,false,null,null,null,1,"нет","Нет","Нет","Нет","Нет","Нет","Нет","Нет","Нет","Нет","Нет","Нет","Нет","Нет","Нет","Нет","Нет","Нет","Нет","Нет","Нет","Нет","Нет","Нет","Нет","Нет","Нет","Нет","Нет","Нет","Нет","Нет","Нет","Нет","Нет","Нет","Нет","Нет","Нет","Нет","Нет","Нет","Нет","Нет","Нет","Нет","Нет","Нет","Нет","Нет","Нет"]
["PAGE2","CheckBox24",{"$f":"IFERROR(INDEX(C80:C88,G79),\"пусто\")","v":"пусто"},null,null,null,{"$f":"MATCH(E80,D80:D88,0)","v":{"$error":"#N/A"}},null,null,{"$f":"IFERROR(IF(I79,C79,\"\"),\"\")","v":""},1,"Каб.зажимы для С-траверсы_в3"]
["PAGE2","ComboBox6_1",{"$f":"IFERROR(INDEX(M80:BJ80,1,$A$5),\"пусто\")","v":"пусто"},{"$f":"CONCATENATE(C80,\" \",INDEX(Наименования!B:B,MATCH(MPx_Add!C80,Наименования!A:A,0)))","v":"пусто "},"CL 38 Кабельные зажимы 30-38мм С-образных монтажных траверс 25шт",null,false,null,null,null,1,"зажимы 6-12мм С-траверс","CL 12","CL 12","CL 12","CL 12","CL 12","CL 12","CL 12","CL 12","CL 12","CL 12","CL 12","CL 12","CL 12","CL 12","CL 12","CL 12","CL 12","CL 12","CL 12","CL 12","CL 12","CL 12","CL 12","CL 12","CL 12","CL 12","CL 12","CL 12","CL 12","CL 12","CL 12","CL 12","CL 12","CL 12","CL 12","CL 12","CL 12","CL 12","CL 12","CL 12","CL 12","CL 12","CL 12","CL 12","CL 12","CL 12","CL 12","CL 12","CL 12","CL 12"]
["PAGE2","ComboBox6_2","пусто",{"$f":"CONCATENATE(C81,\" \",INDEX(Наименования!B:B,MATCH(MPx_Add!C81,Наименования!A:A,0)))","v":"пусто "},null,null,false,null,null,null,1,"зажимы 12-18мм С-траверс","CL 18","CL 18","CL 18","CL 18","CL 18","CL 18","CL 18","CL 18","CL 18","CL 18","CL 18","CL 18","CL 18","CL 18","CL 18","CL 18","CL 18","CL 18","CL 18","CL 18","CL 18","CL 18","CL 18","CL 18","CL 18","CL 18","CL 18","CL 18","CL 18","CL 18","CL 18","CL 18","CL 18","CL 18","CL 18","CL 18","CL 18","CL 18","CL 18","CL 18","CL 18","CL 18","CL 18","CL 18","CL 18","CL 18","CL 18","CL 18","CL 18","CL 18"]
["PAGE2","ComboBox6_3","пусто",{"$f":"CONCATENATE(C82,\" \",INDEX(Наименования!B:B,MATCH(MPx_Add!C82,Наименования!A:A,0)))","v":"пусто "},null,null,false,null,null,null,1,"зажимы 18-22мм С-траверс","CL 22","CL 22","CL 22","CL 22","CL 22","CL 22","CL 22","CL 22","CL 22","CL 22","CL 22","CL 22","CL 22","CL 22","CL 22","CL 22","CL 22","CL 22","CL 22","CL 22","CL 22","CL 22","CL 22","CL 22","CL 22","CL 22","CL 22","CL 22","CL 22","CL 22","CL 22","CL 22","CL 22","CL 22","CL 22","CL 22","CL 22","CL 22","CL 22","CL 22","CL 22","CL 22","CL 22","CL 22","CL 22","CL 22","CL 22","CL 22","CL 22","CL 22"]
["PAGE2","ComboBox6_6","пусто",{"$f":"CONCATENATE(C83,\" \",INDEX(Наименования!B:B,MATCH(MPx_Add!C83,Наименования!A:A,0)))","v":"пусто "},null,null,false,null,null,null,1,"зажимы 22-30мм С-траверс","CL 30","CL 30","CL 30","CL 30","CL 30","CL 30","CL 30","CL 30","CL 30","CL 30","CL 30","CL 30","CL 30","CL 30","CL 30","CL 30","CL 30","CL 30","CL 30","CL 30","CL 30","CL 30","CL 30","CL 30","CL 30","CL 30","CL 30","CL 30","CL 30","CL 30","CL 30","CL 30","CL 30","CL 30","CL 30","CL 30","CL 30","CL 30","CL 30","CL 30","CL 30","CL 30","CL 30","CL 30","CL 30","CL 30","CL 30","CL 30","CL 30","CL 30"]
["PAGE2","ComboBox6_6","пусто",{"$f":"CONCATENATE(C84,\" \",INDEX(Наименования!B:B,MATCH(MPx_Add!C84,Наименования!A:A,0)))","v":"пусто "},null,null,false,null,null,null,1,"зажимы 30-38мм С-траверс","CL 38","CL 38","CL 38","CL 38","CL 38","CL 38","CL 38","CL 38","CL 38","CL 38","CL 38","CL 38","CL 38","CL 38","CL 38","CL 38","CL 38","CL 38","CL 38","CL 38","CL 38","CL 38","CL 38","CL 38","CL 38","CL 38","CL 38","CL 38","CL 38","CL 38","CL 38","CL 38","CL 38","CL 38","CL 38","CL 38","CL 38","CL 38","CL 38","CL 38","CL 38","CL 38","CL 38","CL 38","CL 38","CL 38","CL 38","CL 38","CL 38","CL 38"]
["PAGE2","ComboBox6_6","пусто",{"$f":"CONCATENATE(C85,\" \",INDEX(Наименования!B:B,MATCH(MPx_Add!C85,Наименования!A:A,0)))","v":"пусто "},null,null,false,null,null,null,1,"зажимы 38-42мм С-траверс","CL 42","CL 42","CL 42","CL 42","CL 42","CL 42","CL 42","CL 42","CL 42","CL 42","CL 42","CL 42","CL 42","CL 42","CL 42","CL 42","CL 42","CL 42","CL 42","CL 42","CL 42","CL 42","CL 42","CL 42","CL 42","CL 42","CL 42","CL 42","CL 42","CL 42","CL 42","CL 42","CL 42","CL 42","CL 42","CL 42","CL 42","CL 42","CL 42","CL 42","CL 42","CL 42","CL 42","CL 42","CL 42","CL 42","CL 42","CL 42","CL 42","CL 42"]
["PAGE2","ComboBox6_7","пусто",{"$f":"CONCATENATE(C86,\" \",INDEX(Наименования!B:B,MATCH(MPx_Add!C86,Наименования!A:A,0)))","v":"пусто "},null,null,false,null,null,null,1,"зажимы 42-50мм С-траверс","CL 50","CL 50","CL 50","CL 50","CL 50","CL 50","CL 50","CL 50","CL 50","CL 50","CL 50","CL 50","CL 50","CL 50","CL 50","CL 50","CL 50","CL 50","CL 50","CL 50","CL 50","CL 50","CL 50","CL 50","CL 50","CL 50","CL 50","CL 50","CL 50","CL 50","CL 50","CL 50","CL 50","CL 50","CL 50","CL 50","CL 50","CL 50","CL 50","CL 50","CL 50","CL 50","CL 50","CL 50","CL 50","CL 50","CL 50","CL 50","CL 50","CL 50"]
["PAGE2","ComboBox6_8","пусто",{"$f":"CONCATENATE(C87,\" \",INDEX(Наименования!B:B,MATCH(MPx_Add!C87,Наименования!A:A,0)))","v":"пусто "},null,null,false,null,null,null,1,"зажимы 50-64мм С-траверс","CL 64","CL 64","CL 64","CL 64","CL 64","CL 64","CL 64","CL 64","CL 64","CL 64","CL 64","CL 64","CL 64","CL 64","CL 64","CL 64","CL 64","CL 64","CL 64","CL 64","CL 64","CL 64","CL 64","CL 64","CL 64","CL 64","CL 64","CL 64","CL 64","CL 64","CL 64","CL 64","CL 64","CL 64","CL 64","CL 64","CL 64","CL 64","CL 64","CL 64","CL 64","CL 64","CL 64","CL 64","CL 64","CL 64","CL 64","CL 64","CL 64","CL 64"]
["PAGE2","ComboBox6_9","пусто","Нет",null,null,false,null,null,null,1,"нет","Нет","Нет","Нет","Нет","Нет","Нет","Нет","Нет","Нет","Нет","Нет","Нет","Нет","Нет","Нет","Нет","Нет","Нет","Нет","Нет","Нет","Нет","Нет","Нет","Нет","Нет","Нет","Нет","Нет","Нет","Нет","Нет","Нет","Нет","Нет","Нет","Нет","Нет","Нет","Нет","Нет","Нет","Нет","Нет","Нет","Нет","Нет","Нет","Нет","Нет"]
["PAGE2","CheckBox25",{"$f":"IFERROR(INDEX(C90:C98,G89),\"пусто\")","v":"пусто"},null,null,null,{"$f":"MATCH(E90,D90:D98,0)","v":{"$error":"#N/A"}},null,null,{"$f":"IFERROR(IF(I89,C89,\"\"),\"\")","v":""},1,"Каб.зажимы для С-траверсы_в4"]
["PAGE2","ComboBox7_1",{"$f":"IFERROR(INDEX(M90:BJ90,1,$A$5),\"пусто\")","v":"пусто"},{"$f":"CONCATENATE(C90,\" \",INDEX(Наименования!B:B,MATCH(MPx_Add!C90,Наименования!A:A,0)))","v":"пусто "},"CL 38 Кабельные зажимы 30-38мм С-образных монтажных траверс 25шт",null,false,null,null,null,1,"зажимы 6-12мм С-траверс","CL 12","CL 12","CL 12","CL 12","CL 12","CL 12","CL 12","CL 12","CL 12","CL 12","CL 12","CL 12","CL 12","CL 12","CL 12","CL 12","CL 12","CL 12","CL 12","CL 12","CL 12","CL 12","CL 12","CL 12","CL 12","CL 12","CL 12","CL 12","CL 12","CL 12","CL 12","CL 12","CL 12","CL 12","CL 12","CL 12","CL 12","CL 12","CL 12","CL 12","CL 12","CL 12","CL 12","CL 12","CL 12","CL 12","CL 12","CL 12","CL 12","CL 12"]
["PAGE2","ComboBox7_2","пусто",{"$f":"CONCATENATE(C91,\" \",INDEX(Наименования!B:B,MATCH(MPx_Add!C91,Наименования!A:A,0)))","v":"пусто "},null,null,false,null,null,null,1,"зажимы 12-18мм С-траверс","CL 18","CL 18","CL 18","CL 18","CL 18","CL 18","CL 18","CL 18","CL 18","CL 18","CL 18","CL 18","CL 18","CL 18","CL 18","CL 18","CL 18","CL 18","CL 18","CL 18","CL 18","CL 18","CL 18","CL 18","CL 18","CL 18","CL 18","CL 18","CL 18","CL 18","CL 18","CL 18","CL 18","CL 18","CL 18","CL 18","CL 18","CL 18","CL 18","CL 18","CL 18","CL 18","CL 18","CL 18","CL 18","CL 18","CL 18","CL 18","CL 18","CL 18"]
["PAGE2","ComboBox7_3","пусто",{"$f":"CONCATENATE(C92,\" \",INDEX(Наименования!B:B,MATCH(MPx_Add!C92,Наименования!A:A,0)))","v":"пусто "},null,null,false,null,null,null,1,"зажимы 18-22мм С-траверс","CL 22","CL 22","CL 22","CL 22","CL 22","CL 22","CL 22","CL 22","CL 22","CL 22","CL 22","CL 22","CL 22","CL 22","CL 22","CL 22","CL 22","CL 22","CL 22","CL 22","CL 22","CL 22","CL 22","CL 22","CL 22","CL 22","CL 22","CL 22","CL 22","CL 22","CL 22","CL 22","CL 22","CL 22","CL 22","CL 22","CL 22","CL 22","CL 22","CL 22","CL 22","CL 22","CL 22","CL 22","CL 22","CL 22","CL 22","CL 22","CL 22","CL 22"]
["PAGE2","ComboBox7_7","пусто",{"$f":"CONCATENATE(C93,\" \",INDEX(Наименования!B:B,MATCH(MPx_Add!C93,Наименования!A:A,0)))","v":"пусто "},null,null,false,null,null,null,1,"зажимы 22-30мм С-траверс","CL 30","CL 30","CL 30","CL 30","CL 30","CL 30","CL 30","CL 30","CL 30","CL 30","CL 30","CL 30","CL 30","CL 30","CL 30","CL 30","CL 30","CL 30","CL 30","CL 30","CL 30","CL 30","CL 30","CL 30","CL 30","CL 30","CL 30","CL 30","CL 30","CL 30","CL 30","CL 30","CL 30","CL 30","CL 30","CL 30","CL 30","CL 30","CL 30","CL 30","CL 30","CL 30","CL 30","CL 30","CL 30","CL 30","CL 30","CL 30","CL 30","CL 30"]
["PAGE2","ComboBox7_7","пусто",{"$f":"CONCATENATE(C94,\" \",INDEX(Наименования!B:B,MATCH(MPx_Add!C94,Наименования!A:A,0)))","v":"пусто "},null,null,false,null,null,null,1,"зажимы 30-38мм С-траверс","CL 38","CL 38","CL 38","CL 38","CL 38","CL 38","CL 38","CL 38","CL 38","CL 38","CL 38","CL 38","CL 38","CL 38","CL 38","CL 38","CL 38","CL 38","CL 38","CL 38","CL 38","CL 38","CL 38","CL 38","CL 38","CL 38","CL 38","CL 38","CL 38","CL 38","CL 38","CL 38","CL 38","CL 38","CL 38","CL 38","CL 38","CL 38","CL 38","CL 38","CL 38","CL 38","CL 38","CL 38","CL 38","CL 38","CL 38","CL 38","CL 38","CL 38"]
["PAGE2","ComboBox7_7","пусто",{"$f":"CONCATENATE(C95,\" \",INDEX(Наименования!B:B,MATCH(MPx_Add!C95,Наименования!A:A,0)))","v":"пусто "},null,null,false,null,null,null,1,"зажимы 38-42мм С-траверс","CL 42","CL 42","CL 42","CL 42","CL 42","CL 42","CL 42","CL 42","CL 42","CL 42","CL 42","CL 42","CL 42","CL 42","CL 42","CL 42","CL 42","CL 42","CL 42","CL 42","CL 42","CL 42","CL 42","CL 42","CL 42","CL 42","CL 42","CL 42","CL 42","CL 42","CL 42","CL 42","CL 42","CL 42","CL 42","CL 42","CL 42","CL 42","CL 42","CL 42","CL 42","CL 42","CL 42","CL 42","CL 42","CL 42","CL 42","CL 42","CL 42","CL 42"]
["PAGE2","ComboBox7_7","пусто",{"$f":"CONCATENATE(C96,\" \",INDEX(Наименования!B:B,MATCH(MPx_Add!C96,Наименования!A:A,0)))","v":"пусто "},null,null,false,null,null,null,1,"зажимы 42-50мм С-траверс","CL 50","CL 50","CL 50","CL 50","CL 50","CL 50","CL 50","CL 50","CL 50","CL 50","CL 50","CL 50","CL 50","CL 50","CL 50","CL 50","CL 50","CL 50","CL 50","CL 50","CL 50","CL 50","CL 50","CL 50","CL 50","CL 50","CL 50","CL 50","CL 50","CL 50","CL 50","CL 50","CL 50","CL 50","CL 50","CL 50","CL 50","CL 50","CL 50","CL 50","CL 50","CL 50","CL 50","CL 50","CL 50","CL 50","CL 50","CL 50","CL 50","CL 50"]
["PAGE2","ComboBox7_8","пусто",{"$f":"CONCATENATE(C97,\" \",INDEX(Наименования!B:B,MATCH(MPx_Add!C97,Наименования!A:A,0)))","v":"пусто "},null,null,false,null,null,null,1,"зажимы 50-64мм С-траверс","CL 64","CL 64","CL 64","CL 64","CL 64","CL 64","CL 64","CL 64","CL 64","CL 64","CL 64","CL 64","CL 64","CL 64","CL 64","CL 64","CL 64","CL 64","CL 64","CL 64","CL 64","CL 64","CL 64","CL 64","CL 64","CL 64","CL 64","CL 64","CL 64","CL 64","CL 64","CL 64","CL 64","CL 64","CL 64","CL 64","CL 64","CL 64","CL 64","CL 64","CL 64","CL 64","CL 64","CL 64","CL 64","CL 64","CL 64","CL 64","CL 64","CL 64"]
["PAGE2","ComboBox7_9","пусто","Нет",null,null,false,null,null,null,1,"нет","Нет","Нет","Нет","Нет","Нет","Нет","Нет","Нет","Нет","Нет","Нет","Нет","Нет","Нет","Нет","Нет","Нет","Нет","Нет","Нет","Нет","Нет","Нет","Нет","Нет","Нет","Нет","Нет","Нет","Нет","Нет","Нет","Нет","Нет","Нет","Нет","Нет","Нет","Нет","Нет","Нет","Нет","Нет","Нет","Нет","Нет","Нет","Нет","Нет","Нет"]
["PAGE2","CheckBox27","пусто",null,{"$f":"IF(OR(F99=\"0- \",F99=\"0-\"),\"Кабельная рейка ЭМС\",F99)","v":"пусто "},{"$f":"IFERROR(CONCATENATE(C99,\" \",INDEX(Наименования!B:B,MATCH(C99,Наименования!A:A,0))),\"пусто\")","v":"пусто "},null,{"$f":"IF(E99=F99,TRUE,FALSE)","v":true},null,{"$f":"IFERROR(IF(I99,C99,\"\"),\"\")","v":""},1,"Каб.рейка для фикс. ЭМС","MG 60 EMC","MG 80 EMC","MG 80 EMC","MG 60 EMC","MG 60 EMC","MG 60 EMC","MG 60 EMC","MG 60 EMC","MG 80 EMC","MG 80 EMC","MG 80 EMC","0-","0-","MG 60 EMC","MG 60 EMC","MG 60 EMC","MG 80 EMC","MG 80 EMC","MG 80 EMC","0-","0-","MG 60 EMC","MG 60 EMC","MG 60 EMC","MG 60 EMC","MG 80 EMC","MG 80 EMC","MG 80 EMC","MG 80 EMC","MG 60 EMC","MG 60 EMC","MG 80 EMC","MG 80 EMC","MG 80 EMC","MG 80 EMC","0-","0-","0-","0-","0-","0-","0-","0-","0-","0-","0-","0-","0-","0-","0-"]
["PAGE2","CheckBox28",{"$f":"IFERROR(INDEX(C101:C105,G100),\"пусто\")","v":"пусто"},null,null,null,{"$f":"MATCH(E101,D101:D105,0)","v":5},{"$f":"H99","v":true},null,{"$f":"IFERROR(IF(I100,C100,\"\"),\"\")","v":""},1,"Каб.зажимы для ЭМС-рейки_в1"]
["PAGE2","ComboBox10_1",{"$f":"IFERROR(INDEX(M101:BJ101,1,$A$5),\"пусто\")","v":"пусто"},{"$f":"CONCATENATE(C101,\" \",INDEX(Наименования!B:B,MATCH(MPx_Add!C101,Наименования!A:A,0)))","v":"пусто "},"Нет",null,false,null,null,null,1,"Каб. зажим ЭМС 3-10","CL 10 EMC","CL 10 EMC","CL 10 EMC","CL 10 EMC","CL 10 EMC","CL 10 EMC","CL 10 EMC","CL 10 EMC","CL 10 EMC","CL 10 EMC","CL 10 EMC","CL 10 EMC","CL 10 EMC","CL 10 EMC","CL 10 EMC","CL 10 EMC","CL 10 EMC","CL 10 EMC","CL 10 EMC","CL 10 EMC","CL 10 EMC","CL 10 EMC","CL 10 EMC","CL 10 EMC","CL 10 EMC","CL 10 EMC","CL 10 EMC","CL 10 EMC","CL 10 EMC","CL 10 EMC","CL 10 EMC","CL 10 EMC","CL 10 EMC","CL 10 EMC","CL 10 EMC","CL 10 EMC","CL 10 EMC","CL 10 EMC","CL 10 EMC","CL 10 EMC","CL 10 EMC","CL 10 EMC","CL 10 EMC","CL 10 EMC","CL 10 EMC","CL 10 EMC","CL 10 EMC","CL 10 EMC","CL 10 EMC","CL 10 EMC"]
["PAGE2","ComboBox10_2",{"$f":"IFERROR(INDEX(M102:BJ102,1,$A$5),\"пусто\")","v":"пусто"},{"$f":"CONCATENATE(C102,\" \",INDEX(Наименования!B:B,MATCH(MPx_Add!C102,Наименования!A:A,0)))","v":"пусто "},null,null,false,null,null,null,1,"Каб. зажим ЭМС 4-15","CL 15 EMC","CL 15 EMC","CL 15 EMC","CL 15 EMC","CL 15 EMC","CL 15 EMC","CL 15 EMC","CL 15 EMC","CL 15 EMC","CL 15 EMC","CL 15 EMC","CL 15 EMC","CL 15 EMC","CL 15 EMC","CL 15 EMC","CL 15 EMC","CL 15 EMC","CL 15 EMC","CL 15 EMC","CL 15 EMC","CL 15 EMC","CL 15 EMC","CL 15 EMC","CL 15 EMC","CL 15 EMC","CL 15 EMC","CL 15 EMC","CL 15 EMC","CL 15 EMC","CL 15 EMC","CL 15 EMC","CL 15 EMC","CL 15 EMC","CL 15 EMC","CL 15 EMC","CL 15 EMC","CL 15 EMC","CL 15 EMC","CL 15 EMC","CL 15 EMC","CL 15 EMC","CL 15 EMC","CL 15 EMC","CL 15 EMC","CL 15 EMC","CL 15 EMC","CL 15 EMC","CL 15 EMC","CL 15 EMC","CL 15 EMC"]
["PAGE2","ComboBox10_3",{"$f":"IFERROR(INDEX(M103:BJ103,1,$A$5),\"пусто\")","v":"пусто"},{"$f":"CONCATENATE(C103,\" \",INDEX(Наименования!B:B,MATCH(MPx_Add!C103,Наименования!A:A,0)))","v":"пусто "},null,null,false,null,null,null,1,"Каб. зажим ЭМС 10-20","CL 20 EMC","CL 20 EMC","CL 20 EMC","CL 20 EMC","CL 20 EMC","CL 20 EMC","CL 20 EMC","CL 20 EMC","CL 20 EMC","CL 20 EMC","CL 20 EMC","CL 20 EMC","CL 20 EMC","CL 20 EMC","CL 20 EMC","CL 20 EMC","CL 20 EMC","CL 20 EMC","CL 20 EMC","CL 20 EMC","CL 20 EMC","CL 20 EMC","CL 20 EMC","CL 20 EMC","CL 20 EMC","CL 20 EMC","CL 20 EMC","CL 20 EMC","CL 20 EMC","CL 20 EMC","CL 20 EMC","CL 20 EMC","CL 20 EMC","CL 20 EMC","CL 20 EMC","CL 20 EMC","CL 20 EMC","CL 20 EMC","CL 20 EMC","CL 20 EMC","CL 20 EMC","CL 20 EMC","CL 20 EMC","CL 20 EMC","CL 20 EMC","CL 20 EMC","CL 20 EMC","CL 20 EMC","CL 20 EMC","CL 20 EMC"]
["PAGE2","ComboBox10_4",{"$f":"IFERROR(INDEX(M104:BJ104,1,$A$5),\"пусто\")","v":"пусто"},{"$f":"CONCATENATE(C104,\" \",INDEX(Наименования!B:B,MATCH(MPx_Add!C104,Наименования!A:A,0)))","v":"пусто "},null,null,false,null,null,null,1,"Каб. зажим ЭМС 15-28","CL 28 EMC","CL 28 EMC","CL 28 EMC","CL 28 EMC","CL 28 EMC","CL 28 EMC","CL 28 EMC","CL 28 EMC","CL 28 EMC","CL 28 EMC","CL 28 EMC","CL 28 EMC","CL 28 EMC","CL 28 EMC","CL 28 EMC","CL 28 EMC","CL 28 EMC","CL 28 EMC","CL 28 EMC","CL 28 EMC","CL 28 EMC","CL 28 EMC","CL 28 EMC","CL 28 EMC","CL 28 EMC","CL 28 EMC","CL 28 EMC","CL 28 EMC","CL 28 EMC","CL 28 EMC","CL 28 EMC","CL 28 EMC","CL 28 EMC","CL 28 EMC","CL 28 EMC","CL 28 EMC","CL 28 EMC","CL 28 EMC","CL 28 EMC","CL 28 EMC","CL 28 EMC","CL 28 EMC","CL 28 EMC","CL 28 EMC","CL 28 EMC","CL 28 EMC","CL 28 EMC","CL 28 EMC","CL 28 EMC","CL 28 EMC"]
["PAGE2","ComboBox10_5",{"$f":"IFERROR(INDEX(M105:BJ105,1,$A$5),\"пусто\")","v":"пусто"},"Нет",null,null,false,null,null,null,1,"нет","Нет","Нет","Нет","Нет","Нет","Нет","Нет","Нет","Нет","Нет","Нет","Нет","Нет","Нет","Нет","Нет","Нет","Нет","Нет","Нет","Нет","Нет","Нет","Нет","Нет","Нет","Нет","Нет","Нет","Нет","Нет","Нет","Нет","Нет","Нет","Нет","Нет","Нет","Нет","Нет","Нет","Нет","Нет","Нет","Нет","Нет","Нет","Нет","Нет","Нет"]
["PAGE2","CheckBox29",{"$f":"IFERROR(INDEX(C107:C111,G106),\"пусто\")","v":"пусто"},null,null,null,{"$f":"MATCH(E107,D107:D111,0)","v":{"$error":"#N/A"}},{"$f":"H99","v":true},null,{"$f":"IFERROR(IF(I106,C106,\"\"),\"\")","v":""},1,"Каб.зажимы для ЭМС-рейки_в2"]
["PAGE2","ComboBox11_1",{"$f":"IFERROR(INDEX(M107:BJ107,1,$A$5),\"пусто\")","v":"пусто"},{"$f":"CONCATENATE(C107,\" \",INDEX(Наименования!B:B,MATCH(MPx_Add!C107,Наименования!A:A,0)))","v":"пусто "},"CL 15 EMC Кабельный зажим ЭМС 4-15мм² 10шт",null,false,null,null,null,1,"Каб. зажим ЭМС 3-10","CL 10 EMC","CL 10 EMC","CL 10 EMC","CL 10 EMC","CL 10 EMC","CL 10 EMC","CL 10 EMC","CL 10 EMC","CL 10 EMC","CL 10 EMC","CL 10 EMC","CL 10 EMC","CL 10 EMC","CL 10 EMC","CL 10 EMC","CL 10 EMC","CL 10 EMC","CL 10 EMC","CL 10 EMC","CL 10 EMC","CL 10 EMC","CL 10 EMC","CL 10 EMC","CL 10 EMC","CL 10 EMC","CL 10 EMC","CL 10 EMC","CL 10 EMC","CL 10 EMC","CL 10 EMC","CL 10 EMC","CL 10 EMC","CL 10 EMC","CL 10 EMC","CL 10 EMC","CL 10 EMC","CL 10 EMC","CL 10 EMC","CL 10 EMC","CL 10 EMC","CL 10 EMC","CL 10 EMC","CL 10 EMC","CL 10 EMC","CL 10 EMC","CL 10 EMC","CL 10 EMC","CL 10 EMC","CL 10 EMC","CL 10 EMC"]
["PAGE2","ComboBox11_2",{"$f":"IFERROR(INDEX(M108:BJ108,1,$A$5),\"пусто\")","v":"пусто"},{"$f":"CONCATENATE(C108,\" \",INDEX(Наименования!B:B,MATCH(MPx_Add!C108,Наименования!A:A,0)))","v":"пусто "},null,null,false,null,null,null,1,"Каб. зажим ЭМС 4-15","CL 15 EMC","CL 15 EMC","CL 15 EMC","CL 15 EMC","CL 15 EMC","CL 15 EMC","CL 15 EMC","CL 15 EMC","CL 15 EMC","CL 15 EMC","CL 15 EMC","CL 15 EMC","CL 15 EMC","CL 15 EMC","CL 15 EMC","CL 15 EMC","CL 15 EMC","CL 15 EMC","CL 15 EMC","CL 15 EMC","CL 15 EMC","CL 15 EMC","CL 15 EMC","CL 15 EMC","CL 15 EMC","CL 15 EMC","CL 15 EMC","CL 15 EMC","CL 15 EMC","CL 15 EMC","CL 15 EMC","CL 15 EMC","CL 15 EMC","CL 15 EMC","CL 15 EMC","CL 15 EMC","CL 15 EMC","CL 15 EMC","CL 15 EMC","CL 15 EMC","CL 15 EMC","CL 15 EMC","CL 15 EMC","CL 15 EMC","CL 15 EMC","CL 15 EMC","CL 15 EMC","CL 15 EMC","CL 15 EMC","CL 15 EMC"]
["PAGE2","ComboBox11_3",{"$f":"IFERROR(INDEX(M109:BJ109,1,$A$5),\"пусто\")","v":"пусто"},{"$f":"CONCATENATE(C109,\" \",INDEX(Наименования!B:B,MATCH(MPx_Add!C109,Наименования!A:A,0)))","v":"пусто "},null,null,false,null,null,null,1,"Каб. зажим ЭМС 10-20","CL 20 EMC","CL 20 EMC","CL 20 EMC","CL 20 EMC","CL 20 EMC","CL 20 EMC","CL 20 EMC","CL 20 EMC","CL 20 EMC","CL 20 EMC","CL 20 EMC","CL 20 EMC","CL 20 EMC","CL 20 EMC","CL 20 EMC","CL 20 EMC","CL 20 EMC","CL 20 EMC","CL 20 EMC","CL 20 EMC","CL 20 EMC","CL 20 EMC","CL 20 EMC","CL 20 EMC","CL 20 EMC","CL 20 EMC","CL 20 EMC","CL 20 EMC","CL 20 EMC","CL 20 EMC","CL 20 EMC","CL 20 EMC","CL 20 EMC","CL 20 EMC","CL 20 EMC","CL 20 EMC","CL 20 EMC","CL 20 EMC","CL 20 EMC","CL 20 EMC","CL 20 EMC","CL 20 EMC","CL 20 EMC","CL 20 EMC","CL 20 EMC","CL 20 EMC","CL 20 EMC","CL 20 EMC","CL 20 EMC","CL 20 EMC"]
["PAGE2","ComboBox11_4",{"$f":"IFERROR(INDEX(M110:BJ110,1,$A$5),\"пусто\")","v":"пусто"},{"$f":"CONCATENATE(C110,\" \",INDEX(Наименования!B:B,MATCH(MPx_Add!C110,Наименования!A:A,0)))","v":"пусто "},null,null,false,null,null,null,1,"Каб. зажим ЭМС 15-28","CL 28 EMC","CL 28 EMC","CL 28 EMC","CL 28 EMC","CL 28 EMC","CL 28 EMC","CL 28 EMC","CL 28 EMC","CL 28 EMC","CL 28 EMC","CL 28 EMC","CL 28 EMC","CL 28 EMC","CL 28 EMC","CL 28 EMC","CL 28 EMC","CL 28 EMC","CL 28 EMC","CL 28 EMC","CL 28 EMC","CL 28 EMC","CL 28 EMC","CL 28 EMC","CL 28 EMC","CL 28 EMC","CL 28 EMC","CL 28 EMC","CL 28 EMC","CL 28 EMC","CL 28 EMC","CL 28 EMC","CL 28 EMC","CL 28 EMC","CL 28 EMC","CL 28 EMC","CL 28 EMC","CL 28 EMC","CL 28 EMC","CL 28 EMC","CL 28 EMC","CL 28 EMC","CL 28 EMC","CL 28 EMC","CL 28 EMC","CL 28 EMC","CL 28 EMC","CL 28 EMC","CL 28 EMC","CL 28 EMC","CL 28 EMC"]
["PAGE2","ComboBox11_5",{"$f":"IFERROR(INDEX(M111:BJ111,1,$A$5),\"пусто\")","v":"пусто"},"Нет",null,null,false,null,null,null,1,"нет","Нет","Нет","Нет","Нет","Нет","Нет","Нет","Нет","Нет","Нет","Нет","Нет","Нет","Нет","Нет","Нет","Нет","Нет","Нет","Нет","Нет","Нет","Нет","Нет","Нет","Нет","Нет","Нет","Нет","Нет","Нет","Нет","Нет","Нет","Нет","Нет","Нет","Нет","Нет","Нет","Нет","Нет","Нет","Нет","Нет","Нет","Нет","Нет","Нет","Нет"]
["PAGE3","ComboBox19_val",{"$f":"IFERROR(INDEX(C113:C116,G112),\"пусто\")","v":"пусто"},null,null,null,{"$f":"MATCH(E113,D113:D116,0)","v":{"$error":"#N/A"}},null,null,{"$f":"IFERROR(IF(I112,C112,\"\"),\"\")","v":""},1]
["PAGE3","ComboBox19_1",{"$f":"IFERROR(INDEX(M113:BJ113,1,$A$5),\"пусто\")","v":"пусто"},{"$f":"CONCATENATE(C113,\" \",INDEX(Наименования!B:B,MATCH(MPx_Add!C113,Наименования!A:A,0)))","v":"пусто "},"D 200.80 V Дверь шкафа MPx обзорная 2000х800мм 1шт",null,false,null,null,null,1,"Дверь 1х","D 120.60","D 120.80","D 120.80","D 140.60","D 160.60","D 160.60","D 160.60","D 160.60","D 160.80","D 160.80","D 160.80","D 180.40","D 180.40","D 180.60","D 180.60","D 180.60","D 180.80","D 180.80","D 180.80","D 200.40","D 200.40","D 200.60","D 200.60","D 200.60","D 200.60","D 200.80","D 200.80","D 200.80","D 200.80","D 220.60","D 220.60","D 220.80","D 220.80","D 220.80","D 120.80","0-","0-","0-","0-","0-","0-","0-","0-","0-","0-","0-","0-","0-","0-","0-"]
["PAGE3","ComboBox19_2","пусто",{"$f":"CONCATENATE(C114,\" \",INDEX(Наименования!B:B,MATCH(MPx_Add!C114,Наименования!A:A,0)))","v":"пусто "},null,null,false,null,null,null,1,"Дверь 2х","0-","0-","0-","0-","0-","0-","0-","0-","0-","0-","0-","0-","0-","0-","0-","0-","D 180.80 D","D 180.80 D","D 180.80 D","0-","0-","D 200.60 D","D 200.60 D","D 200.60 D","D 200.60 D","D 200.80 D","D 200.80 D","D 200.80 D","D 200.80 D","0-","0-","D 220.80 D","D 220.80 D","D 220.80 D","0-","D 180.100 D","D 180.120 D","D 180.120 D","D 180.120 D","D 200.100 D","D 200.100 D","D 200.100 D","D 200.100 D","D 200.120 D","D 200.120 D","D 200.120 D","D 200.120 D","D 220.100 D","D 220.100 D","D 220.120 D"]
["PAGE3","ComboBox19_3","пусто",{"$f":"CONCATENATE(C115,\" \",INDEX(Наименования!B:B,MATCH(MPx_Add!C115,Наименования!A:A,0)))","v":"пусто "},null,null,false,null,null,null,1,"Дверь обзорная","D 120.60 V","D 120.80 V","D 120.80 V","0-","D 160.60 V","D 160.60 V","D 160.60 V","D 160.60 V","0-","0-","0-","D 180.40 V","D 180.40 V","D 180.60 V","D 180.60 V","D 180.60 V","D 180.80 V","D 180.80 V","D 180.80 V","D 200.40 V","D 200.40 V","D 200.60 V","D 200.60 V","D 200.60 V","D 200.60 V","D 200.80 V","D 200.80 V","D 200.80 V","D 200.80 V","D 220.60 V","D 220.60 V","D 220.80 V","D 220.80 V","D 220.80 V","D 120.80 V","0-","0-","0-","0-","0-","0-","0-","0-","0-","0-","0-","0-","0-","0-","0-"]
["PAGE3","ComboBox19_4","пусто","Оставить дверь(и) из комплекта поставки",null,null,false,null,null,null,1,"Оставить дверь(и) из компл.пост.","Оставить дверь(и) из компл.пост.","Оставить дверь(и) из компл.пост.","Оставить дверь(и) из компл.пост.","Оставить дверь(и) из компл.пост.","Оставить дверь(и) из компл.пост.","Оставить дверь(и) из компл.пост.","Оставить дверь(и) из компл.пост.","Оставить дверь(и) из компл.пост.","Оставить дверь(и) из компл.пост.","Оставить дверь(и) из компл.пост.","Оставить дверь(и) из компл.пост.","Оставить дверь(и) из компл.пост.","Оставить дверь(и) из компл.пост.","Оставить дверь(и) из компл.пост.","Оставить дверь(и) из компл.пост.","Оставить дверь(и) из компл.пост.","Оставить дверь(и) из компл.пост.","Оставить дверь(и) из компл.пост.","Оставить дверь(и) из компл.пост.","Оставить дверь(и) из компл.пост.","Оставить дверь(и) из компл.пост.","Оставить дверь(и) из компл.пост.","Оставить дверь(и) из компл.пост.","Оставить дверь(и) из компл.пост.","Оставить дверь(и) из компл.пост.","Оставить дверь(и) из компл.пост.","Оставить дверь(и) из компл.пост.","Оставить дверь(и) из компл.пост.","Оставить дверь(и) из компл.пост.","Оставить дверь(и) из компл.пост.","Оставить дверь(и) из компл.пост.","Оставить дверь(и) из компл.пост.","Оставить дверь(и) из компл.пост.","Оставить дверь(и) из компл.пост.","Оставить дверь(и) из компл.пост.","Оставить дверь(и) из компл.пост.","Оставить дверь(и) из компл.пост.","Оставить дверь(и) из компл.пост.","Оставить дверь(и) из компл.пост.","Оставить дверь(и) из компл.пост.","Оставить дверь(и) из компл.пост.","Оставить дверь(и) из компл.пост.","Оставить дверь(и) из компл.пост.","Оставить дверь(и) из компл.пост.","Оставить дверь(и) из компл.пост.","Оставить дверь(и) из компл.пост.","Оставить дверь(и) из компл.пост.","Оставить дверь(и) из компл.пост.","Оставить дверь(и) из компл.пост.","Оставить дверь(и) из компл.пост."]
["PAGE3","CheckBox38","пусто",null,{"$f":"F117","v":"пусто "},{"$f":"IFERROR(CONCATENATE(C117,\" \",INDEX(Наименования!B:B,MATCH(C117,Наименования!A:A,0))),\"пусто\")","v":"пусто "},null,null,null,{"$f":"IFERROR(IF(I117,C117,\"\"),\"\")","v":""},1,"Ручка поворотная","LH 1C.Z","LH 1C.Z","LH 1C.Z","LH 1C.Z","LH 1C.Z","LH 1C.Z","LH 1C.Z","LH 1C.Z","LH 1C.Z","LH 1C.Z","LH 1C.Z","LH 1C.Z","LH 1C.Z","LH 1C.Z","LH 1C.Z","LH 1C.Z","LH 1C.Z","LH 1C.Z","LH 1C.Z","LH 1C.Z","LH 1C.Z","LH 1C.Z","LH 1C.Z","LH 1C.Z","LH 1C.Z","LH 1C.Z","LH 1C.Z","LH 1C.Z","LH 1C.Z","LH 1C.Z","LH 1C.Z","LH 1C.Z","LH 1C.Z","LH 1C.Z","LH 1C.Z","LH 1C.Z","LH 1C.Z","LH 1C.Z","LH 1C.Z","LH 1C.Z","LH 1C.Z","LH 1C.Z","LH 1C.Z","LH 1C.Z","LH 1C.Z","LH 1C.Z","LH 1C.Z","LH 1C.Z","LH 1C.Z","LH 1C.Z"]
["PAGE3","CheckBox37","пусто",null,{"$f":"F118","v":"пусто "},{"$f":"IFERROR(CONCATENATE(C118,\" \",INDEX(Наименования!B:B,MATCH(C118,Наименования!A:A,0))),\"пусто\")","v":"пусто "},null,null,null,{"$f":"IFERROR(IF(I118,C118,\"\"),\"\")","v":""},1,"Карман стальной","DP 60 M","DP 80 M","DP 80 M","DP 60 M","DP 60 M","DP 60 M","DP 60 M","DP 60 M","DP 80 M","DP 80 M","DP 80 M","DP 40 M","DP 40 M","DP 60 M","DP 60 M","DP 60 M","DP 80 M","DP 80 M","DP 80 M","DP 40 M","DP 40 M","DP 60 M","DP 60 M","DP 60 M","DP 60 M","DP 80 M","DP 80 M","DP 80 M","DP 80 M","DP 60 M","DP 60 M","DP 80 M","DP 80 M","DP 80 M","DP 80 M","DP 50 M","DP 60 M","DP 60 M","DP 60 M","DP 50 M","DP 50 M","DP 50 M","DP 50 M","DP 60 M","DP 60 M","DP 60 M","DP 60 M","DP 50 M","DP 50 M","DP 60 M"]
["PAGE3","CheckBox36","пусто",null,{"$f":"F119","v":"пусто "},{"$f":"IFERROR(CONCATENATE(C119,\" \",INDEX(Наименования!B:B,MATCH(C119,Наименования!A:A,0))),\"пусто\")","v":"пусто "},null,null,null,{"$f":"IFERROR(IF(I119,C119,\"\"),\"\")","v":""},1,"Карман пластиковый","DP 40 P","DP 40 P","DP 40 P","DP 40 P","DP 40 P","DP 40 P","DP 40 P","DP 40 P","DP 40 P","DP 40 P","DP 40 P","DP 40 P","DP 40 P","DP 40 P","DP 40 P","DP 40 P","DP 40 P","DP 40 P","DP 40 P","DP 40 P","DP 40 P","DP 40 P","DP 40 P","DP 40 P","DP 40 P","DP 40 P","DP 40 P","DP 40 P","DP 40 P","DP 40 P","DP 40 P","DP 40 P","DP 40 P","DP 40 P","DP 40 P","DP 40 P","DP 40 P","DP 40 P","DP 40 P","DP 40 P","DP 40 P","DP 40 P","DP 40 P","DP 40 P","DP 40 P","DP 40 P","DP 40 P","DP 40 P","DP 40 P","DP 40 P"]
["PAGE3","CheckBox32","пусто",null,{"$f":"IF(OR(F120=\"0- \",F120=\"0-\"),\"Полка для документации на дверь\",F120)","v":"пусто "},{"$f":"IFERROR(CONCATENATE(C120,\" \",INDEX(Наименования!B:B,MATCH(C120,Наименования!A:A,0))),\"пусто\")","v":"пусто "},null,{"$f":"IF(E120=F120,TRUE,FALSE)","v":true},null,{"$f":"IFERROR(IF(I120,C120,\"\"),\"\")","v":""},1,"Полка для документации","SH 60 D","SH 80 D","SH 80 D","SH 60 D","SH 60 D","SH 60 D","SH 60 D","SH 60 D","SH 80 D","SH 80 D","SH 80 D","0-","0-","SH 60 D","SH 60 D","SH 60 D","SH 80 D","SH 80 D","SH 80 D","0-","0-","SH 60 D","SH 60 D","SH 60 D","SH 60 D","SH 80 D","SH 80 D","SH 80 D","SH 80 D","SH 60 D","SH 60 D","SH 80 D","SH 80 D","SH 80 D","SH 80 D","SH 50 D","SH 60 D","SH 60 D","SH 60 D","SH 50 D","SH 50 D","SH 50 D","SH 50 D","SH 60 D","SH 60 D","SH 60 D","SH 60 D","SH 50 D","SH 50 D","SH 60 D"]
["PAGE3","CheckBox33",{"$f":"IFERROR(INDEX(C122:C124,G121),\"пусто\")","v":"пусто"},null,null,null,{"$f":"MATCH(E122,D122:D124,0)","v":{"$error":"#N/A"}},null,null,{"$f":"IFERROR(IF(I121,C121,\"\"),\"\")","v":""},1,"Ограничитель открывания"]
["PAGE3","ComboBox17_1",{"$f":"IFERROR(INDEX(M122:BJ122,1,$A$5),\"пусто\")","v":"пусто"},{"$f":"CONCATENATE(C122,\" \",INDEX(Наименования!B:B,MATCH(MPx_Add!C122,Наименования!A:A,0)))","v":"пусто "},"SD Фиксатор двери шкафа MPx 1шт",null,false,null,null,null,1,"Фиксатор дверь","SD","SD","SD","SD","SD","SD","SD","SD","SD","SD","SD","SD","SD","SD","SD","SD","SD","SD","SD","SD","SD","SD","SD","SD","SD","SD","SD","SD","SD","SD","SD","SD","SD","SD","SD","SD","SD","SD","SD","SD","SD","SD","SD","SD","SD","SD","SD","SD","SD","SD"]
["PAGE3","ComboBox17_2",{"$f":"IFERROR(INDEX(M123:BJ123,1,$A$5),\"пусто\")","v":"пусто"},{"$f":"CONCATENATE(C123,\" \",INDEX(Наименования!B:B,MATCH(MPx_Add!C123,Наименования!A:A,0)))","v":"пусто "},null,null,false,null,null,null,1,"Фиксатор д/путей эвакуации","SD P","SD P","SD P","SD P","SD P","SD P","SD P","SD P","SD P","SD P","SD P","SD P","SD P","SD P","SD P","SD P","SD P","SD P","SD P","SD P","SD P","SD P","SD P","SD P","SD P","SD P","SD P","SD P","SD P","SD P","SD P","SD P","SD P","SD P","SD P","SD P","SD P","SD P","SD P","SD P","SD P","SD P","SD P","SD P","SD P","SD P","SD P","SD P","SD P","SD P"]
["PAGE3","ComboBox17_3",{"$f":"IFERROR(INDEX(M124:BJ124,1,$A$5),\"пусто\")","v":"пусто"},"Нет",null,null,false,null,null,null,1,"нет","Нет","Нет","Нет","Нет","Нет","Нет","Нет","Нет","Нет","Нет","Нет","Нет","Нет","Нет","Нет","Нет","Нет","Нет","Нет","Нет","Нет","Нет","Нет","Нет","Нет","Нет","Нет","Нет","Нет","Нет","Нет","Нет","Нет","Нет","Нет","Нет","Нет","Нет","Нет","Нет","Нет","Нет","Нет","Нет","Нет","Нет","Нет","Нет","Нет","Нет"]
["PAGE3","CheckBox34",{"$f":"IFERROR(INDEX(M125:BJ125,1,$A$5),\"пусто\")","v":"пусто"},null,{"$f":"F125","v":"пусто "},{"$f":"IFERROR(CONCATENATE(C125,\" \",INDEX(Наименования!B:B,MATCH(C125,Наименования!A:A,0))),\"пусто\")","v":"пусто "},null,null,null,{"$f":"IFERROR(IF(I125,C125,\"\"),\"\")","v":""},1,"Рейка двери горизонтальная","VB 60 G","VB 80 G","VB 80 G","VB 60 G","VB 60 G","VB 60 G","VB 60 G","VB 60 G","VB 80 G","VB 80 G","VB 80 G","VB 40 G","VB 40 G","VB 60 G","VB 60 G","VB 60 G","VB 80 G","VB 80 G","VB 80 G","VB 40 G","VB 40 G","VB 60 G","VB 60 G","VB 60 G","VB 60 G","VB 80 G","VB 80 G","VB 80 G","VB 80 G","VB 60 G","VB 60 G","VB 80 G","VB 80 G","VB 80 G","VB 80 G","VB 50 G","VB 60 G","VB 60 G","VB 60 G","VB 50 G","VB 50 G","VB 50 G","VB 50 G","VB 60 G","VB 60 G","VB 60 G","VB 60 G","VB 50 G","VB 50 G","VB 60 G"]
["PAGE3","CheckBox52",{"$f":"IFERROR(INDEX(C127:C129,G126),\"пусто\")","v":"пусто"},null,null,null,{"$f":"MATCH(E127,D127:D129,0)","v":3},null,null,{"$f":"IFERROR(IF(I126,C126,\"\"),\"\")","v":""},1,"Накладная дверь с окном"]
["PAGE3","ComboBox21_1",{"$f":"IFERROR(INDEX(M127:BJ127,1,$A$5),\"пусто\")","v":"пусто"},{"$f":"CONCATENATE(C127,\" \",INDEX(Наименования!B:B,MATCH(MPx_Add!C127,Наименования!A:A,0)))","v":"пусто "},"Нет",null,false,null,null,null,1,"Накладная дверь В370","FT 37.60","FT 37.80","FT 37.80","FT 37.60","FT 37.60","FT 37.60","FT 37.60","FT 37.60","FT 37.80","FT 37.80","FT 37.80","0-","0-","FT 37.60","FT 37.60","FT 37.60","FT 37.80","FT 37.80","FT 37.80","0-","0-","FT 37.60","FT 37.60","FT 37.60","FT 37.60","FT 37.80","FT 37.80","FT 37.80","FT 37.80","FT 37.60","FT 37.60","FT 37.80","FT 37.80","FT 37.80","FT 37.80","0-","FT 37.60","FT 37.60","FT 37.60","0-","0-","0-","0-","FT 37.60","FT 37.60","FT 37.60","FT 37.60","0-","0-","FT 37.60"]
["PAGE3","ComboBox21_2",{"$f":"IFERROR(INDEX(M128:BJ128,1,$A$5),\"пусто\")","v":"пусто"},{"$f":"CONCATENATE(C128,\" \",INDEX(Наименования!B:B,MATCH(MPx_Add!C128,Наименования!A:A,0)))","v":"пусто "},null,null,false,null,null,null,1,"Накладная дверь В670","FT 67.60","FT 67.80","FT 67.80","FT 67.60","FT 67.60","FT 67.60","FT 67.60","FT 67.60","FT 67.80","FT 67.80","FT 67.80","0-","0-","FT 67.60","FT 67.60","FT 67.60","FT 67.80","FT 67.80","FT 67.80","0-","0-","FT 67.60","FT 67.60","FT 67.60","FT 67.60","FT 67.80","FT 67.80","FT 67.80","FT 67.80","FT 67.60","FT 67.60","FT 67.80","FT 67.80","FT 67.80","FT 67.80","0-","FT 67.60","FT 67.60","FT 67.60","0-","0-","0-","0-","FT 67.60","FT 67.60","FT 67.60","FT 67.60","0-","0-","FT 67.60"]
["PAGE3","ComboBox21_3",{"$f":"IFERROR(INDEX(M129:BJ129,1,$A$5),\"пусто\")","v":"пусто"},"Нет",null,null,false,null,null,null,1,"нет","Нет","Нет","Нет","Нет","Нет","Нет","Нет","Нет","Нет","Нет","Нет","Нет","Нет","Нет","Нет","Нет","Нет","Нет","Нет","Нет","Нет","Нет","Нет","Нет","Нет","Нет","Нет","Нет","Нет","Нет","Нет","Нет","Нет","Нет","Нет","Нет","Нет","Нет","Нет","Нет","Нет","Нет","Нет","Нет","Нет","Нет","Нет","Нет","Нет","Нет"]
["PAGE3","CheckBox53",{"$f":"IFERROR(INDEX(M130:BJ130,1,$A$5),\"пусто\")","v":"пусто"},null,{"$f":"IF(OR(F130=\"0- \",F130=\"0-\"),\"Дверь внутренняя\",F130)","v":"пусто "},{"$f":"IFERROR(CONCATENATE(C130,\" \",INDEX(Наименования!B:B,MATCH(C130,Наименования!A:A,0))),\"пусто\")","v":"пусто "},null,{"$f":"IF(E130=F130,TRUE,FALSE)","v":true},null,{"$f":"IFERROR(IF(I130,C130,\"\"),\"\")","v":""},1,"Дверь внутренняя","0-","0-","0-","0-","0-","0-","0-","0-","0-","0-","0-","0-","0-","ID 180.60","ID 180.60","ID 180.60","ID 180.80","ID 180.80","ID 180.80","0-","0-","ID 200.60","ID 200.60","ID 200.60","ID 200.60","ID 200.80","ID 200.80","ID 200.80","ID 200.80","ID 220.60","ID 220.60","ID 220.80","ID 220.80","ID 220.80","0-","0-","0-","0-","0-","0-","0-","0-","0-","0-","0-","0-","0-","0-","0-","0-"]
["PAGE3","CheckBox50",{"$f":"IFERROR(INDEX(C132:C146,G131),\"пусто\")","v":"пусто"},null,null,null,{"$f":"MATCH(E132,D132:D146,0)","v":{"$error":"#N/A"}},null,null,{"$f":"IFERROR(IF(I131,C131,\"\"),\"\")","v":""},1,"Секционная МП по ширине"]
["PAGE3","ComboBox20_1",{"$f":"IFERROR(INDEX(M132:BJ132,1,$A$5),\"пусто\")","v":"пусто"},{"$f":"CONCATENATE(C132,\" \",INDEX(Наименования!B:B,MATCH(MPx_Add!C132,Наименования!A:A,0)))","v":"пусто "},"MP 65.45 M Монтажная панель MPx 650х450мм секционная 1шт",null,false,null,null,null,1,"МП высотой 150","MP 45.15 M","MP 65.15 M","MP 65.15 M","MP 45.15 M","MP 45.15 M","MP 45.15 M","MP 45.15 M","MP 45.15 M","MP 65.15 M","MP 65.15 M","MP 65.15 M","0-","0-","MP 45.15 M","MP 45.15 M","MP 45.15 M","MP 65.15 M","MP 65.15 M","MP 65.15 M","0-","0-","MP 45.15 M","MP 45.15 M","MP 45.15 M","MP 45.15 M","MP 65.15 M","MP 65.15 M","MP 65.15 M","MP 65.15 M","MP 45.15 M","MP 45.15 M","MP 65.15 M","MP 65.15 M","MP 65.15 M","MP 65.15 M","0-","0-","0-","0-","0-","0-","0-","0-","0-","0-","0-","0-","0-","0-","0-"]
["PAGE3","ComboBox20_2","пусто",{"$f":"CONCATENATE(C133,\" \",INDEX(Наименования!B:B,MATCH(MPx_Add!C133,Наименования!A:A,0)))","v":"пусто "},null,null,false,null,null,null,1,"МП высотой 250","MP 45.25 M","MP 65.25 M","MP 65.25 M","MP 45.25 M","MP 45.25 M","MP 45.25 M","MP 45.25 M","MP 45.25 M","MP 65.25 M","MP 65.25 M","MP 65.25 M","0-","0-","MP 45.25 M","MP 45.25 M","MP 45.25 M","MP 65.25 M","MP 65.25 M","MP 65.25 M","0-","0-","MP 45.25 M","MP 45.25 M","MP 45.25 M","MP 45.25 M","MP 65.25 M","MP 65.25 M","MP 65.25 M","MP 65.25 M","MP 45.25 M","MP 45.25 M","MP 65.25 M","MP 65.25 M","MP 65.25 M","MP 65.25 M","0-","0-","0-","0-","0-","0-","0-","0-","0-","0-","0-","0-","0-","0-","0-"]
["PAGE3","ComboBox20_3","пусто",{"$f":"CONCATENATE(C134,\" \",INDEX(Наименования!B:B,MATCH(MPx_Add!C134,Наименования!A:A,0)))","v":"пусто "},null,null,false,null,null,null,1,"МП высотой 350","MP 45.35 M","MP 65.35 M","MP 65.35 M","MP 45.35 M","MP 45.35 M","MP 45.35 M","MP 45.35 M","MP 45.35 M","MP 65.35 M","MP 65.35 M","MP 65.35 M","0-","0-","MP 45.35 M","MP 45.35 M","MP 45.35 M","MP 65.35 M","MP 65.35 M","MP 65.35 M","0-","0-","MP 45.35 M","MP 45.35 M","MP 45.35 M","MP 45.35 M","MP 65.35 M","MP 65.35 M","MP 65.35 M","MP 65.35 M","MP 45.35 M","MP 45.35 M","MP 65.35 M","MP 65.35 M","MP 65.35 M","MP 65.35 M","MP 85.35 M","MP 105.35 M","MP 105.35 M","MP 105.35 M","MP 85.35 M","MP 85.35 M","MP 85.35 M","MP 85.35 M","MP 105.35 M","MP 105.35 M","MP 105.35 M","MP 105.35 M","MP 85.35 M","MP 85.35 M","MP 105.35 M"]
["PAGE3","ComboBox20_4","пусто",{"$f":"CONCATENATE(C135,\" \",INDEX(Наименования!B:B,MATCH(MPx_Add!C135,Наименования!A:A,0)))","v":"пусто "},null,null,false,null,null,null,1,"МП высотой 450","0-","MP 65.45 M","MP 65.45 M","0-","0-","0-","0-","0-","MP 65.45 M","MP 65.45 M","MP 65.45 M","MP 45.25 M","MP 45.25 M","0-","0-","0-","MP 65.45 M","MP 65.45 M","MP 65.45 M","MP 45.25 M","MP 45.25 M","0-","0-","0-","0-","MP 65.45 M","MP 65.45 M","MP 65.45 M","MP 65.45 M","0-","0-","MP 65.45 M","MP 65.45 M","MP 65.45 M","MP 65.45 M","MP 85.45 M","MP 105.45 M","MP 105.45 M","MP 105.45 M","MP 85.45 M","MP 85.45 M","MP 85.45 M","MP 85.45 M","MP 105.45 M","MP 105.45 M","MP 105.45 M","MP 105.45 M","MP 85.45 M","MP 85.45 M","MP 105.45 M"]
["PAGE3","ComboBox20_5","пусто",{"$f":"CONCATENATE(C136,\" \",INDEX(Наименования!B:B,MATCH(MPx_Add!C136,Наименования!A:A,0)))","v":"пусто "},null,null,false,null,null,null,1,"МП высотой 550","MP 45.55 M","MP 65.55 M","MP 65.55 M","MP 45.55 M","MP 45.55 M","MP 45.55 M","MP 45.55 M","MP 45.55 M","MP 65.55 M","MP 65.55 M","MP 65.55 M","0-","0-","MP 45.55 M","MP 45.55 M","MP 45.55 M","MP 65.55 M","MP 65.55 M","MP 65.55 M","0-","0-","MP 45.55 M","MP 45.55 M","MP 45.55 M","MP 45.55 M","MP 65.55 M","MP 65.55 M","MP 65.55 M","MP 65.55 M","MP 45.55 M","MP 45.55 M","MP 65.55 M","MP 65.55 M","MP 65.55 M","MP 65.55 M","0-","0-","0-","0-","0-","0-","0-","0-","0-","0-","0-","0-","0-","0-","0-"]
["PAGE3","ComboBox20_6","пусто",{"$f":"CONCATENATE(C137,\" \",INDEX(Наименования!B:B,MATCH(MPx_Add!C137,Наименования!A:A,0)))","v":"пусто "},null,null,false,null,null,null,1,"МП высотой 1100","0-","0-","0-","0-","0-","0-","0-","0-","0-","0-","0-","0-","0-","0-","0-","0-","0-","0-","0-","0-","0-","0-","0-","0-","0-","0-","0-","0-","0-","0-","0-","0-","0-","0-","0-","0-","0-","0-","0-","0-","0-","0-","0-","0-","0-","0-","0-","0-","0-","0-"]
["PAGE3","ComboBox20_7","пусто",{"$f":"CONCATENATE(C138,\" \",INDEX(Наименования!B:B,MATCH(MPx_Add!C138,Наименования!A:A,0)))","v":"пусто "},null,null,false,null,null,null,1,"МП с перф. Высотой 250","MP 45.25 MP","0-","0-","MP 45.25 MP","MP 45.25 MP","MP 45.25 MP","MP 45.25 MP","MP 45.25 MP","0-","0-","0-","0-","0-","MP 45.25 MP","MP 45.25 MP","MP 45.25 MP","0-","0-","0-","0-","0-","MP 45.25 MP","MP 45.25 MP","MP 45.25 MP","MP 45.25 MP","0-","0-","0-","0-","MP 45.25 MP","MP 45.25 MP","0-","0-","0-","0-","0-","0-","0-","0-","0-","0-","0-","0-","0-","0-","0-","0-","0-","0-","0-"]
["PAGE3","ComboBox20_8","пусто",{"$f":"CONCATENATE(C139,\" \",INDEX(Наименования!B:B,MATCH(MPx_Add!C139,Наименования!A:A,0)))","v":"пусто "},null,null,false,null,null,null,1,"МП с перф. Высотой 350","MP 45.35 MP","MP 65.35 MP","MP 65.35 MP","MP 45.35 MP","MP 45.35 MP","MP 45.35 MP","MP 45.35 MP","MP 45.35 MP","MP 65.35 MP","MP 65.35 MP","MP 65.35 MP","0-","0-","MP 45.35 MP","MP 45.35 MP","MP 45.35 MP","MP 65.35 MP","MP 65.35 MP","MP 65.35 MP","0-","0-","MP 45.35 MP","MP 45.35 MP","MP 45.35 MP","MP 45.35 MP","MP 65.35 MP","MP 65.35 MP","MP 65.35 MP","MP 65.35 MP","MP 45.35 MP","MP 45.35 MP","MP 65.35 MP","MP 65.35 MP","MP 65.35 MP","MP 65.35 MP","0-","0-","0-","0-","0-","0-","0-","0-","0-","0-","0-","0-","0-","0-","0-"]
["PAGE3","ComboBox20_9","пусто",{"$f":"CONCATENATE(C140,\" \",INDEX(Наименования!B:B,MATCH(MPx_Add!C140,Наименования!A:A,0)))","v":"пусто "},null,null,false,null,null,null,1,"МП с перф. Высотой 450","0-","MP 65.45 MP","MP 65.45 MP","0-","0-","0-","0-","0-","MP 65.45 MP","MP 65.45 MP","MP 65.45 MP","0-","0-","0-","0-","0-","MP 65.45 MP","MP 65.45 MP","MP 65.45 MP","0-","0-","0-","0-","0-","0-","MP 65.45 MP","MP 65.45 MP","MP 65.45 MP","MP 65.45 MP","0-","0-","MP 65.45 MP","MP 65.45 MP","MP 65.45 MP","MP 65.45 MP","0-","0-","0-","0-","0-","0-","0-","0-","0-","0-","0-","0-","0-","0-","0-"]
["PAGE3","ComboBox20_10","пусто",{"$f":"CONCATENATE(C141,\" \",INDEX(Наименования!B:B,MATCH(MPx_Add!C141,Наименования!A:A,0)))","v":"пусто "},null,null,false,null,null,null,1,"МП с перф. Высотой 550","MP 45.55 MP","MP 65.55 MP","MP 65.55 MP","MP 45.55 MP","MP 45.55 MP","MP 45.55 MP","MP 45.55 MP","MP 45.55 MP","MP 65.55 MP","MP 65.55 MP","MP 65.55 MP","0-","0-","MP 45.55 MP","MP 45.55 MP","MP 45.55 MP","MP 65.55 MP","MP 65.55 MP","MP 65.55 MP","0-","0-","MP 45.55 MP","MP 45.55 MP","MP 45.55 MP","MP 45.55 MP","MP 65.55 MP","MP 65.55 MP","MP 65.55 MP","MP 65.55 MP","MP 45.55 MP","MP 45.55 MP","MP 65.55 MP","MP 65.55 MP","MP 65.55 MP","MP 65.55 MP","0-","0-","0-","0-","0-","0-","0-","0-","0-","0-","0-","0-","0-","0-","0-"]
["PAGE3","ComboBox20_11","пусто",{"$f":"CONCATENATE(C142,\" \",INDEX(Наименования!B:B,MATCH(MPx_Add!C142,Наименования!A:A,0)))","v":"пусто "},null,null,false,null,null,null,1,"МП сетка высотой 900","0-","MN 90.80 M","MN 90.80 M","0-","0-","0-","0-","0-","MN 90.80 M","MN 90.80 M","MN 90.80 M","0-","0-","0-","0-","0-","MN 90.80 M","MN 90.80 M","MN 90.80 M","0-","0-","0-","0-","0-","0-","MN 90.80 M","MN 90.80 M","MN 90.80 M","MN 90.80 M","0-","0-","MN 90.80 M","MN 90.80 M","MN 90.80 M","MN 90.80 M","MN 90.100 M","0-","0-","0-","MN 90.100 M","MN 90.100 M","MN 90.100 M","MN 90.100 M","0-","0-","0-","0-","MN 90.100 M","MN 90.100 M","0-"]
["PAGE3","ComboBox20_12","пусто",{"$f":"CONCATENATE(C143,\" \",INDEX(Наименования!B:B,MATCH(MPx_Add!C143,Наименования!A:A,0)))","v":"пусто "},null,null,false,null,null,null,1,"МП сетка высотой 1200","MN 120.60 M","MN 120.80 M","MN 120.80 M","MN 120.60 M","MN 120.60 M","MN 120.60 M","MN 120.60 M","MN 120.60 M","MN 120.80 M","MN 120.80 M","MN 120.80 M","0-","0-","MN 120.60 M","MN 120.60 M","MN 120.60 M","MN 120.80 M","MN 120.80 M","MN 120.80 M","0-","0-","MN 120.60 M","MN 120.60 M","MN 120.60 M","MN 120.60 M","MN 120.80 M","MN 120.80 M","MN 120.80 M","MN 120.80 M","MN 120.60 M","MN 120.60 M","MN 120.80 M","MN 120.80 M","MN 120.80 M","MN 120.80 M","0-","0-","0-","0-","0-","0-","0-","0-","0-","0-","0-","0-","0-","0-","0-"]
["PAGE3","ComboBox20_13","пусто",{"$f":"CONCATENATE(C144,\" \",INDEX(Наименования!B:B,MATCH(MPx_Add!C144,Наименования!A:A,0)))","v":"пусто "},null,null,false,null,null,null,1,"МП сетка высотой 1600","0-","0-","0-","0-","MN 160.60 M","MN 160.60 M","MN 160.60 M","MN 160.60 M","MN 160.80 M","MN 160.80 M","MN 160.80 M","0-","0-","MN 160.60 M","MN 160.60 M","MN 160.60 M","MN 160.80 M","MN 160.80 M","MN 160.80 M","0-","0-","MN 160.60 M","MN 160.60 M","MN 160.60 M","MN 160.60 M","MN 160.80 M","MN 160.80 M","MN 160.80 M","MN 160.80 M","MN 160.60 M","MN 160.60 M","MN 160.80 M","MN 160.80 M","MN 160.80 M","0-","MN 160.100 M","0-","0-","0-","MN 160.100 M","MN 160.100 M","MN 160.100 M","MN 160.100 M","0-","0-","0-","0-","MN 160.100 M","MN 160.100 M","0-"]
["PAGE3","ComboBox20_14","пусто",{"$f":"CONCATENATE(C145,\" \",INDEX(Наименования!B:B,MATCH(MPx_Add!C145,Наименования!A:A,0)))","v":"пусто "},null,null,false,null,null,null,1,"МП сетка высотой 1800","0-","0-","0-","0-","0-","0-","0-","0-","0-","0-","0-","MN 180.40 M","MN 180.40 M","MN 180.60 M","MN 180.60 M","MN 180.60 M","MN 180.80 M","MN 180.80 M","MN 180.80 M","MN 180.40 M","MN 180.40 M","MN 180.60 M","MN 180.60 M","MN 180.60 M","MN 180.60 M","MN 180.80 M","MN 180.80 M","MN 180.80 M","MN 180.80 M","MN 180.60 M","MN 180.60 M","MN 180.80 M","MN 180.80 M","MN 180.80 M","0-","MN 180.100 M","MN 180.120 M","MN 180.120 M","MN 180.120 M","MN 180.100 M","MN 180.100 M","MN 180.100 M","MN 180.100 M","MN 180.120 M","MN 180.120 M","MN 180.120 M","MN 180.120 M","MN 180.100 M","MN 180.100 M","MN 180.120 M"]
["PAGE3","ComboBox20_15","пусто","Нет",null,null,false,null,null,null,1,"нет","Нет","Нет","Нет","Нет","Нет","Нет","Нет","Нет","Нет","Нет","Нет","Нет","Нет","Нет","Нет","Нет","Нет","Нет","Нет","Нет","Нет","Нет","Нет","Нет","Нет","Нет","Нет","Нет","Нет","Нет","Нет","Нет","Нет","Нет","Нет","Нет","Нет","Нет","Нет","Нет","Нет","Нет","Нет","Нет","Нет","Нет","Нет","Нет","Нет","Нет"]
["PAGE3","CheckBox54",{"$f":"IFERROR(INDEX(C148:C165,G147),\"пусто\")","v":"пусто"},null,null,null,{"$f":"MATCH(E148,D148:D165,0)","v":{"$error":"#N/A"}},null,null,{"$f":"IFERROR(IF(I147,C147,\"\"),\"\")","v":""},1,"Секционная МП по глубине"]
["PAGE3","ComboBox22_1",{"$f":"IFERROR(INDEX(M148:BJ148,1,$A$5),\"пусто\")","v":"пусто"},{"$f":"CONCATENATE(C148,\" \",INDEX(Наименования!B:B,MATCH(MPx_Add!C148,Наименования!A:A,0)))","v":"пусто "},"MP 65.45 M Монтажная панель MPx 650х450мм секционная 1шт",null,false,null,null,null,1,"МП высотой 150","MP 45.15 M","0-","MP 45.15 M","MP 45.15 M","0-","0-","MP 45.15 M","MP 65.15 M","0-","0-","MP 45.15 M","0-","MP 45.15 M","0-","0-","MP 45.15 M","0-","0-","MP 45.15 M","0-","MP 45.15 M","0-","0-","MP 45.15 M","MP 65.15 M","0-","0-","MP 45.15 M","MP 65.15 M","MP 45.15 M","MP 65.15 M","0-","MP 45.15 M","MP 65.15 M","0-","0-","0-","0-","MP 45.15 M","0-","0-","MP 45.15 M","MP 65.15 M","0-","0-","MP 45.15 M","MP 65.15 M","MP 45.15 M","MP 65.15 M","MP 45.15 M"]
["PAGE3","ComboBox22_2","пусто",{"$f":"CONCATENATE(C149,\" \",INDEX(Наименования!B:B,MATCH(MPx_Add!C149,Наименования!A:A,0)))","v":"пусто "},null,null,false,null,null,null,1,"МП высотой 250","MP 45.25 M","0-","MP 45.25 M","MP 45.25 M","0-","0-","MP 45.25 M","MP 65.25 M","0-","0-","MP 45.25 M","0-","MP 45.25 M","0-","0-","MP 45.25 M","0-","0-","MP 45.25 M","0-","MP 45.25 M","0-","0-","MP 45.25 M","MP 65.25 M","0-","0-","MP 45.25 M","MP 65.25 M","MP 45.25 M","MP 65.25 M","0-","MP 45.25 M","MP 65.25 M","0-","0-","0-","0-","MP 45.25 M","0-","0-","MP 45.25 M","MP 65.25 M","0-","0-","MP 45.25 M","MP 65.25 M","MP 45.25 M","MP 65.25 M","MP 45.25 M"]
["PAGE3","ComboBox22_3","пусто",{"$f":"CONCATENATE(C150,\" \",INDEX(Наименования!B:B,MATCH(MPx_Add!C150,Наименования!A:A,0)))","v":"пусто "},null,null,false,null,null,null,1,"МП высотой 350","MP 45.35 M","0-","MP 45.35 M","MP 45.35 M","0-","0-","MP 45.35 M","MP 65.35 M","0-","0-","MP 45.35 M","0-","MP 45.35 M","0-","0-","MP 45.35 M","0-","0-","MP 45.35 M","0-","MP 45.35 M","0-","0-","MP 45.35 M","MP 65.35 M","0-","0-","MP 45.35 M","MP 65.35 M","MP 45.35 M","MP 65.35 M","0-","MP 45.35 M","MP 65.35 M","0-","0-","0-","0-","MP 45.35 M","0-","0-","MP 45.35 M","MP 65.35 M","0-","0-","MP 45.35 M","MP 65.35 M","MP 45.35 M","MP 65.35 M","MP 45.35 M"]
["PAGE3","ComboBox22_4","пусто",{"$f":"CONCATENATE(C151,\" \",INDEX(Наименования!B:B,MATCH(MPx_Add!C151,Наименования!A:A,0)))","v":"пусто "},null,null,false,null,null,null,1,"МП высотой 450","0-","MP 45.25 M","0-","0-","MP 45.25 M","MP 45.35 M","0-","MP 65.45 M","MP 45.25 M","MP 45.35 M","0-","MP 45.35 M","0-","MP 45.25 M","MP 45.35 M","0-","MP 45.25 M","MP 45.35 M","0-","MP 45.35 M","0-","MP 45.25 M","MP 45.35 M","0-","MP 65.45 M","MP 45.25 M","MP 45.35 M","0-","MP 65.45 M","0-","MP 65.45 M","MP 45.25 M","0-","MP 65.45 M","MP 45.35 M","MP 45.25 M","MP 45.25 M","MP 45.35 M","0-","MP 45.25 M","MP 45.35 M","0-","MP 65.45 M","MP 45.25 M","MP 45.35 M","0-","MP 65.45 M","0-","MP 65.45 M","0-"]
["PAGE3","ComboBox22_5","пусто",{"$f":"CONCATENATE(C152,\" \",INDEX(Наименования!B:B,MATCH(MPx_Add!C152,Наименования!A:A,0)))","v":"пусто "},null,null,false,null,null,null,1,"МП высотой 550","MP 45.55 M","0-","MP 45.55 M","MP 45.55 M","0-","0-","MP 45.55 M","MP 65.55 M","0-","0-","MP 45.55 M","0-","MP 45.55 M","0-","0-","MP 45.55 M","0-","0-","MP 45.55 M","0-","MP 45.55 M","0-","0-","MP 45.55 M","MP 65.55 M","0-","0-","MP 45.55 M","MP 65.55 M","MP 45.55 M","MP 65.55 M","0-","MP 45.55 M","MP 65.55 M","0-","0-","0-","0-","MP 45.55 M","0-","0-","MP 45.55 M","MP 65.55 M","0-","0-","MP 45.55 M","MP 65.55 M","MP 45.55 M","MP 65.55 M","MP 45.55 M"]
["PAGE3","ComboBox22_6","пусто",{"$f":"CONCATENATE(C153,\" \",INDEX(Наименования!B:B,MATCH(MPx_Add!C153,Наименования!A:A,0)))","v":"пусто "},null,null,false,null,null,null,1,"МП высотой 650","MP 65.45 M","MP 65.25 M","MP 65.45 M","MP 65.45 M","MP 65.25 M","MP 65.35 M","MP 65.45 M","0-","MP 65.25 M","MP 65.35 M","MP 65.45 M","MP 65.35 M","MP 65.45 M","MP 65.25 M","MP 65.35 M","MP 65.45 M","MP 65.25 M","MP 65.35 M","MP 65.45 M","MP 65.35 M","MP 65.45 M","MP 65.25 M","MP 65.35 M","MP 65.45 M","0-","MP 65.25 M","MP 65.35 M","MP 65.45 M","0-","MP 65.45 M","0-","MP 65.25 M","MP 65.45 M","0-","MP 65.35 M","MP 65.25 M","MP 65.25 M","MP 65.35 M","MP 65.45 M","MP 65.25 M","MP 65.35 M","MP 65.45 M","0-","MP 65.25 M","MP 65.35 M","MP 65.45 M","0-","MP 65.45 M","0-","MP 65.45 M"]
["PAGE3","ComboBox22_7","пусто",{"$f":"CONCATENATE(C154,\" \",INDEX(Наименования!B:B,MATCH(MPx_Add!C154,Наименования!A:A,0)))","v":"пусто "},null,null,false,null,null,null,1,"МП высотой 850","MP 85.45 M","0-","MP 85.45 M","MP 85.45 M","0-","MP 85.35 M","MP 85.45 M","0-","0-","MP 85.35 M","MP 85.45 M","MP 85.35 M","MP 85.45 M","0-","MP 85.35 M","MP 85.45 M","0-","MP 85.35 M","MP 85.45 M","MP 85.35 M","MP 85.45 M","0-","MP 85.35 M","MP 85.45 M","0-","0-","MP 85.35 M","MP 85.45 M","0-","MP 85.45 M","0-","0-","MP 85.45 M","0-","MP 85.35 M","0-","0-","MP 85.35 M","MP 85.45 M","0-","MP 85.35 M","MP 85.45 M","0-","0-","MP 85.35 M","MP 85.45 M","0-","MP 85.45 M","0-","MP 85.45 M"]
["PAGE3","ComboBox22_8","пусто",{"$f":"CONCATENATE(C155,\" \",INDEX(Наименования!B:B,MATCH(MPx_Add!C155,Наименования!A:A,0)))","v":"пусто "},null,null,false,null,null,null,1,"МП высотой 1050","MP 105.45 M","0-","MP 105.45 M","MP 105.45 M","0-","0-","MP 105.45 M","0-","0-","0-","MP 105.45 M","0-","MP 105.45 M","0-","0-","MP 105.45 M","0-","0-","MP 105.45 M","0-","MP 105.45 M","0-","0-","MP 105.45 M","0-","0-","0-","MP 105.45 M","0-","MP 105.45 M","0-","0-","MP 105.45 M","0-","0-","0-","0-","0-","MP 105.45 M","0-","0-","MP 105.45 M","0-","0-","0-","MP 105.45 M","0-","MP 105.45 M","0-","MP 105.45 M"]
["PAGE3","ComboBox22_9","пусто",{"$f":"CONCATENATE(C156,\" \",INDEX(Наименования!B:B,MATCH(MPx_Add!C156,Наименования!A:A,0)))","v":"пусто "},null,null,false,null,null,null,1,"МП с перф. Высотой 250","MP 45.25 MP","0-","MP 45.25 MP","MP 45.25 MP","0-","0-","MP 45.25 MP","0-","0-","0-","MP 45.25 MP","0-","MP 45.25 MP","0-","0-","MP 45.25 MP","0-","0-","MP 45.25 MP","0-","MP 45.25 MP","0-","0-","MP 45.25 MP","0-","0-","0-","MP 45.25 MP","0-","MP 45.25 MP","0-","0-","MP 45.25 MP","0-","0-","0-","0-","0-","MP 45.25 MP","0-","0-","MP 45.25 MP","0-","0-","0-","MP 45.25 MP","0-","MP 45.25 MP","0-","MP 45.25 MP"]
["PAGE3","ComboBox22_10","пусто",{"$f":"CONCATENATE(C157,\" \",INDEX(Наименования!B:B,MATCH(MPx_Add!C157,Наименования!A:A,0)))","v":"пусто "},null,null,false,null,null,null,1,"МП с перф. Высотой 350","MP 45.35 MP","0-","MP 45.35 MP","MP 45.35 MP","0-","0-","MP 45.35 MP","MP 65.35 MP","0-","0-","MP 45.35 MP","0-","MP 45.35 MP","0-","0-","MP 45.35 MP","0-","0-","MP 45.35 MP","0-","MP 45.35 MP","0-","0-","MP 45.35 MP","MP 65.35 MP","0-","0-","MP 45.35 MP","MP 65.35 MP","MP 45.35 MP","MP 65.35 MP","0-","MP 45.35 MP","MP 65.35 MP","0-","0-","0-","0-","MP 45.35 MP","0-","0-","MP 45.35 MP","MP 65.35 MP","0-","0-","MP 45.35 MP","MP 65.35 MP","MP 45.35 MP","MP 65.35 MP","MP 45.35 MP"]
["PAGE3","ComboBox22_11","пусто",{"$f":"CONCATENATE(C158,\" \",INDEX(Наименования!B:B,MATCH(MPx_Add!C158,Наименования!A:A,0)))","v":"пусто "},null,null,false,null,null,null,1,"МП с перф. Высотой 450","0-","MP 45.25 MP","0-","0-","MP 45.25 MP","MP 45.35 MP","0-","MP 65.45 MP","MP 45.25 MP","MP 45.35 MP","0-","MP 45.35 MP","0-","MP 45.25 MP","MP 45.35 MP","0-","MP 45.25 MP","MP 45.35 MP","0-","MP 45.35 MP","0-","MP 45.25 MP","MP 45.35 MP","0-","MP 65.45 MP","MP 45.25 MP","MP 45.35 MP","0-","MP 65.45 MP","0-","MP 65.45 MP","MP 45.25 MP","0-","MP 65.45 MP","MP 45.35 MP","MP 45.25 MP","MP 45.25 MP","MP 45.35 MP","0-","MP 45.25 MP","MP 45.35 MP","0-","MP 65.45 MP","MP 45.25 MP","MP 45.35 MP","0-","MP 65.45 MP","0-","MP 65.45 MP","0-"]
["PAGE3","ComboBox22_12","пусто",{"$f":"CONCATENATE(C159,\" \",INDEX(Наименования!B:B,MATCH(MPx_Add!C159,Наименования!A:A,0)))","v":"пусто "},null,null,false,null,null,null,1,"МП с перф. Высотой 550","MP 45.55 MP","0-","MP 45.55 MP","MP 45.55 MP","0-","0-","MP 45.55 MP","MP 65.55 MP","0-","0-","MP 45.55 MP","0-","MP 45.55 MP","0-","0-","MP 45.55 MP","0-","0-","MP 45.55 MP","0-","MP 45.55 MP","0-","0-","MP 45.55 MP","MP 65.55 MP","0-","0-","MP 45.55 MP","MP 65.55 MP","MP 45.55 MP","MP 65.55 MP","0-","MP 45.55 MP","MP 65.55 MP","0-","0-","0-","0-","MP 45.55 MP","0-","0-","MP 45.55 MP","MP 65.55 MP","0-","0-","MP 45.55 MP","MP 65.55 MP","MP 45.55 MP","MP 65.55 MP","MP 45.55 MP"]
["PAGE3","ComboBox22_13","пусто",{"$f":"CONCATENATE(C160,\" \",INDEX(Наименования!B:B,MATCH(MPx_Add!C160,Наименования!A:A,0)))","v":"пусто "},null,null,false,null,null,null,1,"МП с перф. Высотой 650","MP 65.45 MP","0-","MP 65.45 MP","MP 65.45 MP","0-","MP 65.35 MP","MP 65.45 MP","0-","0-","MP 65.35 MP","MP 65.45 MP","MP 65.35 MP","MP 65.45 MP","0-","MP 65.35 MP","MP 65.45 MP","0-","MP 65.35 MP","MP 65.45 MP","MP 65.35 MP","MP 65.45 MP","0-","MP 65.35 MP","MP 65.45 MP","0-","0-","MP 65.35 MP","MP 65.45 MP","0-","MP 65.45 MP","0-","0-","MP 65.45 MP","0-","MP 65.35 MP","0-","0-","MP 65.35 MP","MP 65.45 MP","0-","MP 65.35 MP","MP 65.45 MP","0-","0-","MP 65.35 MP","MP 65.45 MP","0-","MP 65.45 MP","0-","MP 65.45 MP"]
["PAGE3","ComboBox22_14","пусто",{"$f":"CONCATENATE(C161,\" \",INDEX(Наименования!B:B,MATCH(MPx_Add!C161,Наименования!A:A,0)))","v":"пусто "},null,null,false,null,null,null,1,"МП сетка высотой 900","0-","0-","0-","0-","0-","0-","0-","MN 90.80 M","0-","0-","0-","0-","0-","0-","0-","0-","0-","0-","0-","0-","0-","0-","0-","0-","MN 90.80 M","0-","0-","0-","MN 90.80 M","0-","MN 90.80 M","0-","0-","MN 90.80 M","0-","0-","0-","0-","0-","0-","0-","0-","MN 90.80 M","0-","0-","0-","MN 90.80 M","0-","MN 90.80 M","0-"]
["PAGE3","ComboBox22_15","пусто",{"$f":"CONCATENATE(C162,\" \",INDEX(Наименования!B:B,MATCH(MPx_Add!C162,Наименования!A:A,0)))","v":"пусто "},null,null,false,null,null,null,1,"МП сетка высотой 1200","MN 120.60 M","0-","MN 120.60 M","MN 120.60 M","0-","0-","MN 120.60 M","MN 120.80 M","0-","0-","MN 120.60 M","0-","MN 120.60 M","0-","0-","MN 120.60 M","0-","0-","MN 120.60 M","0-","MN 120.60 M","0-","0-","MN 120.60 M","MN 120.80 M","0-","0-","MN 120.60 M","MN 120.80 M","MN 120.60 M","MN 120.80 M","0-","MN 120.60 M","MN 120.80 M","0-","0-","0-","0-","MN 120.60 M","0-","0-","MN 120.60 M","MN 120.80 M","0-","0-","MN 120.60 M","MN 120.80 M","MN 120.60 M","MN 120.80 M","MN 120.60 M"]
["PAGE3","ComboBox22_16","пусто",{"$f":"CONCATENATE(C163,\" \",INDEX(Наименования!B:B,MATCH(MPx_Add!C163,Наименования!A:A,0)))","v":"пусто "},null,null,false,null,null,null,1,"МП сетка высотой 1600","0-","0-","0-","0-","0-","0-","MN 160.60 M","MN 160.80 M","0-","0-","MN 160.60 M","0-","MN 160.60 M","0-","0-","MN 160.60 M","0-","0-","MN 160.60 M","0-","MN 160.60 M","0-","0-","MN 160.60 M","MN 160.80 M","0-","0-","MN 160.60 M","MN 160.80 M","MN 160.60 M","MN 160.80 M","0-","MN 160.60 M","MN 160.80 M","0-","0-","0-","0-","MN 160.60 M","0-","0-","MN 160.60 M","MN 160.80 M","0-","0-","MN 160.60 M","MN 160.80 M","MN 160.60 M","MN 160.80 M","MN 160.60 M"]
["PAGE3","ComboBox22_17","пусто",{"$f":"CONCATENATE(C164,\" \",INDEX(Наименования!B:B,MATCH(MPx_Add!C164,Наименования!A:A,0)))","v":"пусто "},null,null,false,null,null,null,1,"МП сетка высотой 1800","0-","0-","0-","0-","0-","0-","0-","0-","0-","0-","0-","0-","MN 180.60 M","MN 180.40 M","0-","MN 180.60 M","MN 180.40 M","0-","MN 180.60 M","0-","MN 180.60 M","MN 180.40 M","0-","MN 180.60 M","MN 180.80 M","MN 180.40 M","0-","MN 180.60 M","MN 180.80 M","MN 180.60 M","MN 180.80 M","MN 180.40 M","MN 180.60 M","MN 180.80 M","0-","MN 180.40 M","MN 180.40 M","0-","MN 180.60 M","MN 180.40 M","0-","MN 180.60 M","MN 180.80 M","MN 180.40 M","0-","MN 180.60 M","MN 180.80 M","MN 180.60 M","MN 180.80 M","MN 180.60 M"]
["PAGE3","ComboBox22_18","пусто","Нет",null,null,false,null,null,null,1,"нет","Нет","Нет","Нет","Нет","Нет","Нет","Нет","Нет","Нет","Нет","Нет","Нет","Нет","Нет","Нет","Нет","Нет","Нет","Нет","Нет","Нет","Нет","Нет","Нет","Нет","Нет","Нет","Нет","Нет","Нет","Нет","Нет","Нет","Нет","Нет","Нет","Нет","Нет","Нет","Нет","Нет","Нет","Нет","Нет","Нет","Нет","Нет","Нет","Нет","Нет"]
["PAGE3","CheckBox49",{"$f":"IFERROR(INDEX(C167:C172,G166),\"пусто\")","v":"пусто"},null,null,null,{"$f":"MATCH(E167,D167:D172,0)","v":{"$error":"#N/A"}},null,null,{"$f":"IFERROR(IF(I166,C166,\"\"),\"\")","v":""},1,"Монтажная рейка по ширине"]
["PAGE3","ComboBox23_1",{"$f":"IFERROR(INDEX(M167:BJ167,1,$A$5),\"пусто\")","v":"пусто"},{"$f":"CONCATENATE(C167,\" \",INDEX(Наименования!B:B,MATCH(MPx_Add!C167,Наименования!A:A,0)))","v":"пусто "},"MG 40.09 Монтажная рейка 74x14мм внутренний уровень MPx 400мм 4шт",null,false,null,null,null,1,"рейка 24x14мм внутренний ур.","MG 60.03","MG 80.03","MG 80.03","MG 60.03","MG 60.03","MG 60.03","MG 60.03","MG 60.03","MG 80.03","MG 80.03","MG 80.03","MG 40.03","MG 40.03","MG 60.03","MG 60.03","MG 60.03","MG 80.03","MG 80.03","MG 80.03","MG 40.03","MG 40.03","MG 60.03","MG 60.03","MG 60.03","MG 60.03","MG 80.03","MG 80.03","MG 80.03","MG 80.03","MG 60.03","MG 60.03","MG 80.03","MG 80.03","MG 80.03","MG 80.03","0-","0-","0-","0-","0-","0-","0-","0-","0-","0-","0-","0-","0-","0-","0-"]
["PAGE3","ComboBox23_2","пусто",{"$f":"CONCATENATE(C168,\" \",INDEX(Наименования!B:B,MATCH(MPx_Add!C168,Наименования!A:A,0)))","v":"пусто "},null,null,false,null,null,null,1,"рейка 49x14мм внутренний ур.","MG 60.06","MG 80.06","MG 80.06","MG 60.06","MG 60.06","MG 60.06","MG 60.06","MG 60.06","MG 80.06","MG 80.06","MG 80.06","MG 40.06","MG 40.06","MG 60.06","MG 60.06","MG 60.06","MG 80.06","MG 80.06","MG 80.06","MG 40.06","MG 40.06","MG 60.06","MG 60.06","MG 60.06","MG 60.06","MG 80.06","MG 80.06","MG 80.06","MG 80.06","MG 60.06","MG 60.06","MG 80.06","MG 80.06","MG 80.06","MG 80.06","MG 100.06","MG 120.06","MG 120.06","MG 120.06","MG 100.06","MG 100.06","MG 100.06","MG 100.06","MG 120.06","MG 120.06","MG 120.06","MG 120.06","MG 100.06","MG 100.06","MG 120.06"]
["PAGE3","ComboBox23_3","пусто",{"$f":"CONCATENATE(C169,\" \",INDEX(Наименования!B:B,MATCH(MPx_Add!C169,Наименования!A:A,0)))","v":"пусто "},null,null,false,null,null,null,1,"рейка 74x14мм внутренний ур.","MG 60.09","MG 80.09","MG 80.09","MG 60.09","MG 60.09","MG 60.09","MG 60.09","MG 60.09","MG 80.09","MG 80.09","MG 80.09","MG 40.09","MG 40.09","MG 60.09","MG 60.09","MG 60.09","MG 80.09","MG 80.09","MG 80.09","MG 40.09","MG 40.09","MG 60.09","MG 60.09","MG 60.09","MG 60.09","MG 80.09","MG 80.09","MG 80.09","MG 80.09","MG 60.09","MG 60.09","MG 80.09","MG 80.09","MG 80.09","MG 80.09","MG 100.09","MG 120.09","MG 120.09","MG 120.09","MG 100.09","MG 100.09","MG 100.09","MG 100.09","MG 120.09","MG 120.09","MG 120.09","MG 120.09","MG 100.09","MG 100.09","MG 120.09"]
["PAGE3","ComboBox23_4","пусто",{"$f":"CONCATENATE(C170,\" \",INDEX(Наименования!B:B,MATCH(MPx_Add!C170,Наименования!A:A,0)))","v":"пусто "},null,null,false,null,null,null,1,"рейка 49x30мм вн. и внеш. Ур.","MG 60.06 L v.2","MG 80.06 L v.2","MG 80.06 L v.2","MG 60.06 L v.2","MG 60.06 L v.2","MG 60.06 L v.2","MG 60.06 L v.2","MG 60.06 L v.2","MG 80.06 L v.2","MG 80.06 L v.2","MG 80.06 L v.2","MG 40.06 L v.2","MG 40.06 L v.2","MG 60.06 L v.2","MG 60.06 L v.2","MG 60.06 L v.2","MG 80.06 L v.2","MG 80.06 L v.2","MG 80.06 L v.2","MG 40.06 L v.2","MG 40.06 L v.2","MG 60.06 L v.2","MG 60.06 L v.2","MG 60.06 L v.2","MG 60.06 L v.2","MG 80.06 L v.2","MG 80.06 L v.2","MG 80.06 L v.2","MG 80.06 L v.2","MG 60.06 L v.2","MG 60.06 L v.2","MG 80.06 L v.2","MG 80.06 L v.2","MG 80.06 L v.2","MG 80.06 L v.2","MG 100.06 L v.2","MG 120.06 L v.2","MG 120.06 L v.2","MG 120.06 L v.2","MG 100.06 L v.2","MG 100.06 L v.2","MG 100.06 L v.2","MG 100.06 L v.2","MG 120.06 L v.2","MG 120.06 L v.2","MG 120.06 L v.2","MG 120.06 L v.2","MG 100.06 L v.2","MG 100.06 L v.2","MG 120.06 L v.2"]
["PAGE3","ComboBox23_5","пусто",{"$f":"CONCATENATE(C171,\" \",INDEX(Наименования!B:B,MATCH(MPx_Add!C171,Наименования!A:A,0)))","v":"пусто "},null,null,false,null,null,null,1,"рейка 74x30мм вн. и внеш. Ур.","MG 60.09 L v.2","MG 80.09 L v.2","MG 80.09 L v.2","MG 60.09 L v.2","MG 60.09 L v.2","MG 60.09 L v.2","MG 60.09 L v.2","MG 60.09 L v.2","MG 80.09 L v.2","MG 80.09 L v.2","MG 80.09 L v.2","MG 40.09 L v.2","MG 40.09 L v.2","MG 60.09 L v.2","MG 60.09 L v.2","MG 60.09 L v.2","MG 80.09 L v.2","MG 80.09 L v.2","MG 80.09 L v.2","MG 40.09 L v.2","MG 40.09 L v.2","MG 60.09 L v.2","MG 60.09 L v.2","MG 60.09 L v.2","MG 60.09 L v.2","MG 80.09 L v.2","MG 80.09 L v.2","MG 80.09 L v.2","MG 80.09 L v.2","MG 60.09 L v.2","MG 60.09 L v.2","MG 80.09 L v.2","MG 80.09 L v.2","MG 80.09 L v.2","MG 80.09 L v.2","MG 100.09 L v.2","MG 120.09 L v.2","MG 120.09 L v.2","MG 120.09 L v.2","MG 100.09 L v.2","MG 100.09 L v.2","MG 100.09 L v.2","MG 100.09 L v.2","MG 120.09 L v.2","MG 120.09 L v.2","MG 120.09 L v.2","MG 120.09 L v.2","MG 100.09 L v.2","MG 100.09 L v.2","MG 120.09 L v.2"]
["PAGE3","ComboBox23_6","пусто","Нет",null,null,false,null,null,null,1,"нет","Нет","Нет","Нет","Нет","Нет","Нет","Нет","Нет","Нет","Нет","Нет","Нет","Нет","Нет","Нет","Нет","Нет","Нет","Нет","Нет","Нет","Нет","Нет","Нет","Нет","Нет","Нет","Нет","Нет","Нет","Нет","Нет","Нет","Нет","Нет","Нет","Нет","Нет","Нет","Нет","Нет","Нет","Нет","Нет","Нет","Нет","Нет","Нет","Нет","Нет"]
["PAGE3","CheckBox55",{"$f":"IFERROR(INDEX(C174:C179,G173),\"пусто\")","v":"пусто"},null,null,null,{"$f":"MATCH(E174,D174:D179,0)","v":{"$error":"#N/A"}},null,null,{"$f":"IFERROR(IF(I173,C173,\"\"),\"\")","v":""},1,"Монтажная рейка по глубине"]
["PAGE3","ComboBox24_1",{"$f":"IFERROR(INDEX(M174:BJ174,1,$A$5),\"пусто\")","v":"пусто"},{"$f":"CONCATENATE(C174,\" \",INDEX(Наименования!B:B,MATCH(MPx_Add!C174,Наименования!A:A,0)))","v":"пусто "},"MG 50.09 Монтажная рейка 74x14мм внутренний уровень MPx 500мм 4шт",null,false,null,null,null,1,"рейка 24x14мм внутренний ур.","MG 60.03","MG 40.03","MG 60.03","MG 60.03","MG 40.03","MG 50.03","MG 60.03","MG 80.03","MG 40.03","MG 50.03","MG 60.03","MG 50.03","MG 60.03","MG 40.03","MG 50.03","MG 60.03","MG 40.03","MG 50.03","MG 60.03","MG 50.03","MG 60.03","MG 40.03","MG 50.03","MG 60.03","MG 80.03","MG 40.03","MG 50.03","MG 60.03","MG 80.03","MG 60.03","MG 80.03","MG 40.03","MG 60.03","MG 80.03","MG 50.03","MG 40.03","MG 40.03","MG 50.03","MG 60.03","MG 40.03","MG 50.03","MG 60.03","MG 80.03","MG 40.03","MG 50.03","MG 60.03","MG 80.03","MG 60.03","MG 80.03","MG 60.03"]
["PAGE3","ComboBox24_2","пусто",{"$f":"CONCATENATE(C175,\" \",INDEX(Наименования!B:B,MATCH(MPx_Add!C175,Наименования!A:A,0)))","v":"пусто "},null,null,false,null,null,null,1,"рейка 49x14мм внутренний ур.","MG 60.06","MG 40.06","MG 60.06","MG 60.06","MG 40.06","MG 50.06","MG 60.06","MG 80.06","MG 40.06","MG 50.06","MG 60.06","MG 50.06","MG 60.06","MG 40.06","MG 50.06","MG 60.06","MG 40.06","MG 50.06","MG 60.06","MG 50.06","MG 60.06","MG 40.06","MG 50.06","MG 60.06","MG 80.06","MG 40.06","MG 50.06","MG 60.06","MG 80.06","MG 60.06","MG 80.06","MG 40.06","MG 60.06","MG 80.06","MG 50.06","MG 40.06","MG 40.06","MG 50.06","MG 60.06","MG 40.06","MG 50.06","MG 60.06","MG 80.06","MG 40.06","MG 50.06","MG 60.06","MG 80.06","MG 60.06","MG 80.06","MG 60.06"]
["PAGE3","ComboBox24_3","пусто",{"$f":"CONCATENATE(C176,\" \",INDEX(Наименования!B:B,MATCH(MPx_Add!C176,Наименования!A:A,0)))","v":"пусто "},null,null,false,null,null,null,1,"рейка 74x14мм внутренний ур.","MG 60.09","MG 40.09","MG 60.09","MG 60.09","MG 40.09","MG 50.09","MG 60.09","MG 80.09","MG 40.09","MG 50.09","MG 60.09","MG 50.09","MG 60.09","MG 40.09","MG 50.09","MG 60.09","MG 40.09","MG 50.09","MG 60.09","MG 50.09","MG 60.09","MG 40.09","MG 50.09","MG 60.09","MG 80.09","MG 40.09","MG 50.09","MG 60.09","MG 80.09","MG 60.09","MG 80.09","MG 40.09","MG 60.09","MG 80.09","MG 50.09","MG 40.09","MG 40.09","MG 50.09","MG 60.09","MG 40.09","MG 50.09","MG 60.09","MG 80.09","MG 40.09","MG 50.09","MG 60.09","MG 80.09","MG 60.09","MG 80.09","MG 60.09"]
["PAGE3","ComboBox24_4","пусто",{"$f":"CONCATENATE(C177,\" \",INDEX(Наименования!B:B,MATCH(MPx_Add!C177,Наименования!A:A,0)))","v":"пусто "},null,null,false,null,null,null,1,"рейка 49x30мм вн. и внеш. Ур.","MG 60.06 L v.2","MG 40.06 L v.2","MG 60.06 L v.2","MG 60.06 L v.2","MG 40.06 L v.2","MG 50.06 L v.2","MG 60.06 L v.2","MG 80.06 L v.2","MG 40.06 L v.2","MG 50.06 L v.2","MG 60.06 L v.2","MG 50.06 L v.2","MG 60.06 L v.2","MG 40.06 L v.2","MG 50.06 L v.2","MG 60.06 L v.2","MG 40.06 L v.2","MG 50.06 L v.2","MG 60.06 L v.2","MG 50.06 L v.2","MG 60.06 L v.2","MG 40.06 L v.2","MG 50.06 L v.2","MG 60.06 L v.2","MG 80.06 L v.2","MG 40.06 L v.2","MG 50.06 L v.2","MG 60.06 L v.2","MG 80.06 L v.2","MG 60.06 L v.2","MG 80.06 L v.2","MG 40.06 L v.2","MG 60.06 L v.2","MG 80.06 L v.2","MG 50.06 L v.2","MG 40.06 L v.2","MG 40.06 L v.2","MG 50.06 L v.2","MG 60.06 L v.2","MG 40.06 L v.2","MG 50.06 L v.2","MG 60.06 L v.2","MG 80.06 L v.2","MG 40.06 L v.2","MG 50.06 L v.2","MG 60.06 L v.2","MG 80.06 L v.2","MG 60.06 L v.2","MG 80.06 L v.2","MG 60.06 L v.2"]
["PAGE3","ComboBox24_5","пусто",{"$f":"CONCATENATE(C178,\" \",INDEX(Наименования!B:B,MATCH(MPx_Add!C178,Наименования!A:A,0)))","v":"пусто "},null,null,false,null,null,null,1,"рейка 74x30мм вн. и внеш. ур.","MG 60.09 L v.2","MG 40.09 L v.2","MG 60.09 L v.2","MG 60.09 L v.2","MG 40.09 L v.2","MG 50.09 L v.2","MG 60.09 L v.2","MG 80.09 L v.2","MG 40.09 L v.2","MG 50.09 L v.2","MG 60.09 L v.2","MG 50.09 L v.2","MG 60.09 L v.2","MG 40.09 L v.2","MG 50.09 L v.2","MG 60.09 L v.2","MG 40.09 L v.2","MG 50.09 L v.2","MG 60.09 L v.2","MG 50.09 L v.2","MG 60.09 L v.2","MG 40.09 L v.2","MG 50.09 L v.2","MG 60.09 L v.2","MG 80.09 L v.2","MG 40.09 L v.2","MG 50.09 L v.2","MG 60.09 L v.2","MG 80.09 L v.2","MG 60.09 L v.2","MG 80.09 L v.2","MG 40.09 L v.2","MG 60.09 L v.2","MG 80.09 L v.2","MG 50.09 L v.2","MG 40.09 L v.2","MG 40.09 L v.2","MG 50.09 L v.2","MG 60.09 L v.2","MG 40.09 L v.2","MG 50.09 L v.2","MG 60.09 L v.2","MG 80.09 L v.2","MG 40.09 L v.2","MG 50.09 L v.2","MG 60.09 L v.2","MG 80.09 L v.2","MG 60.09 L v.2","MG 80.09 L v.2","MG 60.09 L v.2"]
["PAGE3","ComboBox24_6","пусто","Нет",null,null,false,null,null,null,1,"нет","Нет","Нет","Нет","Нет","Нет","Нет","Нет","Нет","Нет","Нет","Нет","Нет","Нет","Нет","Нет","Нет","Нет","Нет","Нет","Нет","Нет","Нет","Нет","Нет","Нет","Нет","Нет","Нет","Нет","Нет","Нет","Нет","Нет","Нет","Нет","Нет","Нет","Нет","Нет","Нет","Нет","Нет","Нет","Нет","Нет","Нет","Нет","Нет","Нет","Нет"]
["PAGE3","CheckBox56",{"$f":"IFERROR(INDEX(C181:C185,G180),\"пусто\")","v":"пусто"},null,null,null,{"$f":"MATCH(E181,D181:D185,0)","v":{"$error":"#N/A"}},null,null,{"$f":"IFERROR(IF(I180,C180,\"\"),\"\")","v":""},1,"Монтажная рейка вертикальная"]
["PAGE3","ComboBox25_1",{"$f":"IFERROR(INDEX(M181:BJ181,1,$A$5),\"пусто\")","v":"пусто"},{"$f":"CONCATENATE(C181,\" \",INDEX(Наименования!B:B,MATCH(MPx_Add!C181,Наименования!A:A,0)))","v":"пусто "},"MG 180.09 L v.2 Монтажная рейка 74x30мм внутренний и внешний уровень MPx 1800мм 4шт",null,false,null,null,null,1,"рейка 74x30мм MPx 1200мм","MG 120.09 L v.2","MG 120.09 L v.2","MG 120.09 L v.2","MG 120.09 L v.2","MG 120.09 L v.2","MG 120.09 L v.2","MG 120.09 L v.2","MG 120.09 L v.2","MG 120.09 L v.2","MG 120.09 L v.2","MG 120.09 L v.2","MG 120.09 L v.2","MG 120.09 L v.2","MG 120.09 L v.2","MG 120.09 L v.2","MG 120.09 L v.2","MG 120.09 L v.2","MG 120.09 L v.2","MG 120.09 L v.2","MG 120.09 L v.2","MG 120.09 L v.2","MG 120.09 L v.2","MG 120.09 L v.2","MG 120.09 L v.2","MG 120.09 L v.2","MG 120.09 L v.2","MG 120.09 L v.2","MG 120.09 L v.2","MG 120.09 L v.2","MG 120.09 L v.2","MG 120.09 L v.2","MG 120.09 L v.2","MG 120.09 L v.2","MG 120.09 L v.2","MG 120.09 L v.2","MG 120.09 L v.2","MG 120.09 L v.2","MG 120.09 L v.2","MG 120.09 L v.2","MG 120.09 L v.2","MG 120.09 L v.2","MG 120.09 L v.2","MG 120.09 L v.2","MG 120.09 L v.2","MG 120.09 L v.2","MG 120.09 L v.2","MG 120.09 L v.2","MG 120.09 L v.2","MG 120.09 L v.2","MG 120.09 L v.2"]
["PAGE3","ComboBox25_2",{"$f":"IFERROR(INDEX(M182:BJ182,1,$A$5),\"пусто\")","v":"пусто"},{"$f":"CONCATENATE(C182,\" \",INDEX(Наименования!B:B,MATCH(MPx_Add!C182,Наименования!A:A,0)))","v":"пусто "},null,null,false,null,null,null,1,"рейка 74x30мм MPx 1800мм","0-","0-","0-","0-","0-","0-","0-","0-","0-","0-","0-","MG 180.09 L v.2","MG 180.09 L v.2","MG 180.09 L v.2","MG 180.09 L v.2","MG 180.09 L v.2","MG 180.09 L v.2","MG 180.09 L v.2","MG 180.09 L v.2","MG 180.09 L v.2","MG 180.09 L v.2","MG 180.09 L v.2","MG 180.09 L v.2","MG 180.09 L v.2","MG 180.09 L v.2","MG 180.09 L v.2","MG 180.09 L v.2","MG 180.09 L v.2","MG 180.09 L v.2","MG 180.09 L v.2","MG 180.09 L v.2","MG 180.09 L v.2","MG 180.09 L v.2","MG 180.09 L v.2","0-","MG 180.09 L v.2","MG 180.09 L v.2","MG 180.09 L v.2","MG 180.09 L v.2","MG 180.09 L v.2","MG 180.09 L v.2","MG 180.09 L v.2","MG 180.09 L v.2","MG 180.09 L v.2","MG 180.09 L v.2","MG 180.09 L v.2","MG 180.09 L v.2","MG 180.09 L v.2","MG 180.09 L v.2","MG 180.09 L v.2"]
["PAGE3","ComboBox25_3",{"$f":"IFERROR(INDEX(M183:BJ183,1,$A$5),\"пусто\")","v":"пусто"},{"$f":"CONCATENATE(C183,\" \",INDEX(Наименования!B:B,MATCH(MPx_Add!C183,Наименования!A:A,0)))","v":"пусто "},null,null,false,null,null,null,1,"рейка 74x30мм MPx 2000мм","0-","0-","0-","0-","0-","0-","0-","0-","0-","0-","0-","0-","0-","0-","0-","0-","0-","0-","0-","MG 200.09 L v.2","MG 200.09 L v.2","MG 200.09 L v.2","MG 200.09 L v.2","MG 200.09 L v.2","MG 200.09 L v.2","MG 200.09 L v.2","MG 200.09 L v.2","MG 200.09 L v.2","MG 200.09 L v.2","MG 200.09 L v.2","MG 200.09 L v.2","MG 200.09 L v.2","MG 200.09 L v.2","MG 200.09 L v.2","0-","0-","0-","0-","0-","MG 200.09 L v.2","MG 200.09 L v.2","MG 200.09 L v.2","MG 200.09 L v.2","MG 200.09 L v.2","MG 200.09 L v.2","MG 200.09 L v.2","MG 200.09 L v.2","MG 200.09 L v.2","MG 200.09 L v.2","MG 200.09 L v.2"]
["PAGE3","ComboBox25_4",{"$f":"IFERROR(INDEX(M184:BJ184,1,$A$5),\"пусто\")","v":"пусто"},{"$f":"CONCATENATE(C184,\" \",INDEX(Наименования!B:B,MATCH(MPx_Add!C184,Наименования!A:A,0)))","v":"пусто "},null,null,false,null,null,null,1,"рейка 74x30мм MPx 2200мм","0-","0-","0-","0-","0-","0-","0-","0-","0-","0-","0-","0-","0-","0-","0-","0-","0-","0-","0-","0-","0-","0-","0-","0-","0-","0-","0-","0-","0-","MG 220.09 L v.2","MG 220.09 L v.2","MG 220.09 L v.2","MG 220.09 L v.2","MG 220.09 L v.2","0-","0-","0-","0-","0-","0-","0-","0-","0-","0-","0-","0-","0-","MG 220.09 L v.2","MG 220.09 L v.2","MG 220.09 L v.2"]
["PAGE3","ComboBox25_5",{"$f":"IFERROR(INDEX(M185:BJ185,1,$A$5),\"пусто\")","v":"пусто"},"Нет",null,null,false,null,null,null,1,"нет","Нет","Нет","Нет","Нет","Нет","Нет","Нет","Нет","Нет","Нет","Нет","Нет","Нет","Нет","Нет","Нет","Нет","Нет","Нет","Нет","Нет","Нет","Нет","Нет","Нет","Нет","Нет","Нет","Нет","Нет","Нет","Нет","Нет","Нет","Нет","Нет","Нет","Нет","Нет","Нет","Нет","Нет","Нет","Нет","Нет","Нет","Нет","Нет","Нет","Нет"]
["PAGE3","CheckBox57",{"$f":"IFERROR(INDEX(C187:C191,G186),\"пусто\")","v":"пусто"},null,null,null,{"$f":"MATCH(E187,D187:D191,0)","v":5},null,null,{"$f":"IFERROR(IF(I186,C186,\"\"),\"\")","v":""},1,"Организация 19\" плоскости"]
["PAGE3","ComboBox26_1",{"$f":"IFERROR(INDEX(M187:BJ187,1,$A$5),\"пусто\")","v":"пусто"},{"$f":"CONCATENATE(C187,\" \",INDEX(Наименования!B:B,MATCH(MPx_Add!C187,Наименования!A:A,0)))","v":"пусто "},"Нет",null,false,null,null,null,1,"Рейка 19\" ","MG 120 IT","MG 120 IT","MG 120 IT","MG 140 IT","MG 160 IT","MG 160 IT","MG 160 IT","MG 160 IT","MG 160 IT","MG 160 IT","MG 160 IT","MG 180 IT","MG 180 IT","MG 180 IT","MG 180 IT","MG 180 IT","MG 180 IT","MG 180 IT","MG 180 IT","MG 200 IT","MG 200 IT","MG 200 IT","MG 200 IT","MG 200 IT","MG 200 IT","MG 200 IT","MG 200 IT","MG 200 IT","MG 200 IT","MG 220 IT","MG 220 IT","MG 220 IT","MG 220 IT","MG 220 IT","MG 120 IT","MG 180 IT","MG 180 IT","MG 180 IT","MG 180 IT","MG 200 IT","MG 200 IT","MG 200 IT","MG 200 IT","MG 200 IT","MG 200 IT","MG 200 IT","MG 200 IT","MG 220 IT","MG 220 IT","MG 220 IT"]
["PAGE3","ComboBox26_2","пусто",{"$f":"CONCATENATE(C188,\" \",INDEX(Наименования!B:B,MATCH(MPx_Add!C188,Наименования!A:A,0)))","v":"пусто "},null,null,false,null,null,null,1,"Рама 19\" двухстор. MPx 2000х800мм","0-","0-","0-","0-","0-","0-","0-","0-","0-","0-","0-","0-","0-","0-","0-","0-","0-","0-","0-","0-","0-","0-","0-","0-","0-","MC 200.80 ID","MC 200.80 ID","MC 200.80 ID","MC 200.80 ID","0-","0-","0-","0-","0-","0-","0-","0-","0-","0-","0-","0-","0-","0-","0-","0-","0-","0-","0-","0-","0-"]
["PAGE3","ComboBox26_3","пусто",{"$f":"CONCATENATE(C189,\" \",INDEX(Наименования!B:B,MATCH(MPx_Add!C189,Наименования!A:A,0)))","v":"пусто "},null,null,false,null,null,null,1,"Рама повор. шкафа MPx 2000х800мм","0-","0-","0-","0-","0-","0-","0-","0-","0-","0-","0-","0-","0-","0-","0-","0-","0-","0-","0-","0-","0-","0-","0-","0-","0-","MC 200.80 IRP","MC 200.80 IRP","MC 200.80 IRP","MC 200.80 IRP","0-","0-","0-","0-","0-","0-","0-","0-","0-","0-","0-","0-","0-","0-","0-","0-","0-","0-","0-","0-","0-"]
["PAGE3","ComboBox26_4","пусто",{"$f":"CONCATENATE(C190,\" \",INDEX(Наименования!B:B,MATCH(MPx_Add!C190,Наименования!A:A,0)))","v":"пусто "},null,null,false,null,null,null,1,"Рама повор.12U шкафа MPx ш. 800мм","0-","MC 80.80 IRP","MC 80.80 IRP","0-","0-","0-","0-","0-","MC 80.80 IRP","MC 80.80 IRP","MC 80.80 IRP","0-","0-","0-","0-","0-","MC 80.80 IRP","MC 80.80 IRP","MC 80.80 IRP","0-","0-","0-","0-","0-","0-","MC 80.80 IRP","MC 80.80 IRP","MC 80.80 IRP","MC 80.80 IRP","0-","0-","MC 80.80 IRP","MC 80.80 IRP","MC 80.80 IRP","MC 80.80 IRP","0-","0-","0-","0-","0-","0-","0-","0-","0-","0-","0-","0-","0-","0-","0-"]
["PAGE3","ComboBox26_5","пусто","Нет",null,null,false,null,null,null,1,"нет","Нет","Нет","Нет","Нет","Нет","Нет","Нет","Нет","Нет","Нет","Нет","Нет","Нет","Нет","Нет","Нет","Нет","Нет","Нет","Нет","Нет","Нет","Нет","Нет","Нет","Нет","Нет","Нет","Нет","Нет","Нет","Нет","Нет","Нет","Нет","Нет","Нет","Нет","Нет","Нет","Нет","Нет","Нет","Нет","Нет","Нет","Нет","Нет","Нет","Нет"]
["PAGE3","CheckBox58","пусто",null,{"$f":"IF(OR(F192=\"0- \",F192=\"0-\"),\"Монтажная рейка для установки 19\"\" профилей\",F192)","v":"пусто "},{"$f":"IFERROR(CONCATENATE(C192,\" \",INDEX(Наименования!B:B,MATCH(C192,Наименования!A:A,0))),\"пусто\")","v":"пусто "},null,{"$f":"IF(E192=F192,TRUE,FALSE)","v":true},null,{"$f":"IFERROR(IF(I192,C192,\"\"),\"\")","v":""},1,"рейка 74x30мм вн. и внеш. ур.","MG 60.09 L v.2","MG 40.09 L v.2","MG 60.09 L v.2","MG 60.09 L v.2","MG 40.09 L v.2","MG 50.09 L v.2","MG 60.09 L v.2","MG 80.09 L v.2","MG 40.09 L v.2","MG 50.09 L v.2","MG 60.09 L v.2","0-","0-","MG 40.09 L v.2","MG 50.09 L v.2","MG 60.09 L v.2","MG 40.09 L v.2","MG 50.09 L v.2","MG 60.09 L v.2","0-","0-","MG 40.09 L v.2","MG 50.09 L v.2","MG 60.09 L v.2","MG 80.09 L v.2","MG 40.09 L v.2","MG 50.09 L v.2","MG 60.09 L v.2","MG 80.09 L v.2","MG 60.09 L v.2","MG 80.09 L v.2","MG 40.09 L v.2","MG 60.09 L v.2","MG 80.09 L v.2","MG 50.09 L v.2","0-","0-","0-","0-","0-","0-","0-","0-","0-","0-","0-","0-","0-","0-","0-"]
["PAGE3","CheckBox59","пусто",null,{"$f":"IF(OR(F193=\"0- \",F193=\"0-\"),\"B 6 G Комплект крепления реек 19\"\" в шкафы МРх шириной 800мм 1шт\",F193)","v":"пусто "},{"$f":"IFERROR(CONCATENATE(C193,\" \",INDEX(Наименования!B:B,MATCH(C193,Наименования!A:A,0))),\"пусто\")","v":"пусто "},null,{"$f":"IF(E193=F193,TRUE,FALSE)","v":true},null,{"$f":"IFERROR(IF(I193,C193,\"\"),\"\")","v":""},1,"комплект крепл. 19\" реек в ш800","0-","B 6 G","B 6 G","0-","0-","0-","0-","0-","B 6 G","B 6 G","B 6 G","0-","0-","0-","0-","0-","B 6 G","B 6 G","B 6 G","0-","0-","0-","0-","0-","0-","B 6 G","B 6 G","B 6 G","B 6 G","0-","0-","B 6 G","B 6 G","B 6 G","B 6 G","0-","0-","0-","0-","0-","0-","0-","0-","0-","0-","0-","0-","0-","0-","0-"]
["PAGE4","CheckBox60",{"$f":"IFERROR(INDEX(C195:C197,G194),\"пусто\")","v":"пусто"},null,null,null,{"$f":"MATCH(E195,D195:D197,0)","v":{"$error":"#N/A"}},null,null,{"$f":"IFERROR(IF(I194,C194,\"\"),\"\")","v":""},1,"динрейка 35х7,5"]
["PAGE4","ComboBox27_1",{"$f":"IFERROR(INDEX(M195:BJ195,1,$A$5),\"пусто\")","v":"пусто"},{"$f":"CONCATENATE(C195,\" \",INDEX(Наименования!B:B,MATCH(MPx_Add!C195,Наименования!A:A,0)))","v":"пусто "},"DR 07.725 DIN-рейка 35х7,5х725мм для шкафа шириной 800мм 10шт",null,false,null,null,null,1,"DIN-рейка по ширине шкафа","DR 07.525","DR 07.725","DR 07.725","DR 07.525","DR 07.525","DR 07.525","DR 07.525","DR 07.525","DR 07.725","DR 07.725","DR 07.725","DR 07.325","DR 07.325","DR 07.525","DR 07.525","DR 07.525","DR 07.725","DR 07.725","DR 07.725","DR 07.325","DR 07.325","DR 07.525","DR 07.525","DR 07.525","DR 07.525","DR 07.725","DR 07.725","DR 07.725","DR 07.725","DR 07.525","DR 07.525","DR 07.725","DR 07.725","DR 07.725","DR 07.725","0-","0-","0-","0-","0-","0-","0-","0-","0-","0-","0-","0-","0-","0-","0-"]
["PAGE4","ComboBox27_2",{"$f":"IFERROR(INDEX(M196:BJ196,1,$A$5),\"пусто\")","v":"пусто"},{"$f":"CONCATENATE(C196,\" \",INDEX(Наименования!B:B,MATCH(MPx_Add!C196,Наименования!A:A,0)))","v":"пусто "},null,null,false,null,null,null,1,"динрейка 2000мм","DR 07.2000","DR 07.2000","DR 07.2000","DR 07.2000","DR 07.2000","DR 07.2000","DR 07.2000","DR 07.2000","DR 07.2000","DR 07.2000","DR 07.2000","DR 07.2000","DR 07.2000","DR 07.2000","DR 07.2000","DR 07.2000","DR 07.2000","DR 07.2000","DR 07.2000","DR 07.2000","DR 07.2000","DR 07.2000","DR 07.2000","DR 07.2000","DR 07.2000","DR 07.2000","DR 07.2000","DR 07.2000","DR 07.2000","DR 07.2000","DR 07.2000","DR 07.2000","DR 07.2000","DR 07.2000","DR 07.2000","DR 07.2000","DR 07.2000","DR 07.2000","DR 07.2000","DR 07.2000","DR 07.2000","DR 07.2000","DR 07.2000","DR 07.2000","DR 07.2000","DR 07.2000","DR 07.2000","DR 07.2000","DR 07.2000","DR 07.2000"]
["PAGE4","ComboBox27_3",{"$f":"IFERROR(INDEX(M197:BJ197,1,$A$5),\"пусто\")","v":"пусто"},"Нет",null,null,false,null,null,null,1,"нет","Нет","Нет","Нет","Нет","Нет","Нет","Нет","Нет","Нет","Нет","Нет","Нет","Нет","Нет","Нет","Нет","Нет","Нет","Нет","Нет","Нет","Нет","Нет","Нет","Нет","Нет","Нет","Нет","Нет","Нет","Нет","Нет","Нет","Нет","Нет","Нет","Нет","Нет","Нет","Нет","Нет","Нет","Нет","Нет","Нет","Нет","Нет","Нет","Нет","Нет"]
["PAGE4","CheckBox61",{"$f":"IFERROR(INDEX(C199:C201,G198),\"пусто\")","v":"пусто"},null,null,null,{"$f":"MATCH(E199,D199:D201,0)","v":{"$error":"#N/A"}},null,null,{"$f":"IFERROR(IF(I198,C198,\"\"),\"\")","v":""},1,"динрейка 35х15"]
["PAGE4","ComboBox28_1",{"$f":"IFERROR(INDEX(M199:BJ199,1,$A$5),\"пусто\")","v":"пусто"},{"$f":"CONCATENATE(C199,\" \",INDEX(Наименования!B:B,MATCH(MPx_Add!C199,Наименования!A:A,0)))","v":"пусто "},"DR 15.2000 DIN-рейка 35х15х2000мм 10шт",null,false,null,null,null,1,"DIN-рейка по ширине шкафа","DR 15.525","DR 15.725","DR 15.725","DR 15.525","DR 15.525","DR 15.525","DR 15.525","DR 15.525","DR 15.725","DR 15.725","DR 15.725","DR 15.325","DR 15.325","DR 15.525","DR 15.525","DR 15.525","DR 15.725","DR 15.725","DR 15.725","DR 15.325","DR 15.325","DR 15.525","DR 15.525","DR 15.525","DR 15.525","DR 15.725","DR 15.725","DR 15.725","DR 15.725","DR 15.525","DR 15.525","DR 15.725","DR 15.725","DR 15.725","DR 15.725","0-","0-","0-","0-","0-","0-","0-","0-","0-","0-","0-","0-","0-","0-","0-"]
["PAGE4","ComboBox28_2","пусто",{"$f":"CONCATENATE(C200,\" \",INDEX(Наименования!B:B,MATCH(MPx_Add!C200,Наименования!A:A,0)))","v":"пусто "},null,null,false,null,null,null,1,"динрейка 2000мм","DR 15.2000","DR 15.2000","DR 15.2000","DR 15.2000","DR 15.2000","DR 15.2000","DR 15.2000","DR 15.2000","DR 15.2000","DR 15.2000","DR 15.2000","DR 15.2000","DR 15.2000","DR 15.2000","DR 15.2000","DR 15.2000","DR 15.2000","DR 15.2000","DR 15.2000","DR 15.2000","DR 15.2000","DR 15.2000","DR 15.2000","DR 15.2000","DR 15.2000","DR 15.2000","DR 15.2000","DR 15.2000","DR 15.2000","DR 15.2000","DR 15.2000","DR 15.2000","DR 15.2000","DR 15.2000","DR 15.2000","DR 15.2000","DR 15.2000","DR 15.2000","DR 15.2000","DR 15.2000","DR 15.2000","DR 15.2000","DR 15.2000","DR 15.2000","DR 15.2000","DR 15.2000","DR 15.2000","DR 15.2000","DR 15.2000","DR 15.2000"]
["PAGE4","ComboBox28_3","пусто","Нет",null,null,false,null,null,null,1,"нет","Нет","Нет","Нет","Нет","Нет","Нет","Нет","Нет","Нет","Нет","Нет","Нет","Нет","Нет","Нет","Нет","Нет","Нет","Нет","Нет","Нет","Нет","Нет","Нет","Нет","Нет","Нет","Нет","Нет","Нет","Нет","Нет","Нет","Нет","Нет","Нет","Нет","Нет","Нет","Нет","Нет","Нет","Нет","Нет","Нет","Нет","Нет","Нет","Нет","Нет"]
["PAGE4","CheckBox64","пусто",null,{"$f":"F202","v":"пусто "},{"$f":"IFERROR(CONCATENATE(C202,\" \",INDEX(Наименования!B:B,MATCH(C202,Наименования!A:A,0))),\"пусто\")","v":"пусто "},null,null,null,{"$f":"IFERROR(IF(I202,C202,\"\"),\"\")","v":""},1,"Держатель динрейки горизонт.","B 6 DR","B 6 DR","B 6 DR","B 6 DR","B 6 DR","B 6 DR","B 6 DR","B 6 DR","B 6 DR","B 6 DR","B 6 DR","B 6 DR","B 6 DR","B 6 DR","B 6 DR","B 6 DR","B 6 DR","B 6 DR","B 6 DR","B 6 DR","B 6 DR","B 6 DR","B 6 DR","B 6 DR","B 6 DR","B 6 DR","B 6 DR","B 6 DR","B 6 DR","B 6 DR","B 6 DR","B 6 DR","B 6 DR","B 6 DR","B 6 DR","B 6 DR","B 6 DR","B 6 DR","B 6 DR","B 6 DR","B 6 DR","B 6 DR","B 6 DR","B 6 DR","B 6 DR","B 6 DR","B 6 DR","B 6 DR","B 6 DR","B 6 DR"]
["PAGE4","CheckBox63","пусто",null,{"$f":"F203","v":"пусто "},{"$f":"IFERROR(CONCATENATE(C203,\" \",INDEX(Наименования!B:B,MATCH(C203,Наименования!A:A,0))),\"пусто\")","v":"пусто "},null,null,null,"",1,"Держатель динрейки наклонный","B 5.35 DR","B 5.35 DR","B 5.35 DR","B 5.35 DR","B 5.35 DR","B 5.35 DR","B 5.35 DR","B 5.35 DR","B 5.35 DR","B 5.35 DR","B 5.35 DR","B 5.35 DR","B 5.35 DR","B 5.35 DR","B 5.35 DR","B 5.35 DR","B 5.35 DR","B 5.35 DR","B 5.35 DR","B 5.35 DR","B 5.35 DR","B 5.35 DR","B 5.35 DR","B 5.35 DR","B 5.35 DR","B 5.35 DR","B 5.35 DR","B 5.35 DR","B 5.35 DR","B 5.35 DR","B 5.35 DR","B 5.35 DR","B 5.35 DR","B 5.35 DR","B 5.35 DR","B 5.35 DR","B 5.35 DR","B 5.35 DR","B 5.35 DR","B 5.35 DR","B 5.35 DR","B 5.35 DR","B 5.35 DR","B 5.35 DR","B 5.35 DR","B 5.35 DR","B 5.35 DR","B 5.35 DR","B 5.35 DR","B 5.35 DR"]
["PAGE4","CheckBox72","пусто",null,{"$f":"F204","v":"пусто "},{"$f":"IFERROR(CONCATENATE(C204,\" \",INDEX(Наименования!B:B,MATCH(C204,Наименования!A:A,0))),\"пусто\")","v":"пусто "},null,null,null,"",1,"Центральная точка заземления","EK 8 GP","EK 8 GP","EK 8 GP","EK 8 GP","EK 8 GP","EK 8 GP","EK 8 GP","EK 8 GP","EK 8 GP","EK 8 GP","EK 8 GP","EK 8 GP","EK 8 GP","EK 8 GP","EK 8 GP","EK 8 GP","EK 8 GP","EK 8 GP","EK 8 GP","EK 8 GP","EK 8 GP","EK 8 GP","EK 8 GP","EK 8 GP","EK 8 GP","EK 8 GP","EK 8 GP","EK 8 GP","EK 8 GP","EK 8 GP","EK 8 GP","EK 8 GP","EK 8 GP","EK 8 GP","EK 8 GP","EK 8 GP","EK 8 GP","EK 8 GP","EK 8 GP","EK 8 GP","EK 8 GP","EK 8 GP","EK 8 GP","EK 8 GP","EK 8 GP","EK 8 GP","EK 8 GP","EK 8 GP","EK 8 GP","EK 8 GP"]
["PAGE4","CheckBox66","пусто",null,{"$f":"F205","v":"пусто "},{"$f":"IFERROR(CONCATENATE(C205,\" \",INDEX(Наименования!B:B,MATCH(C205,Наименования!A:A,0))),\"пусто\")","v":"пусто "},null,null,null,"",1,"Шина заземления 15х5х450","BI 1.45 E","BI 1.45 E","BI 1.45 E","BI 1.45 E","BI 1.45 E","BI 1.45 E","BI 1.45 E","BI 1.45 E","BI 1.45 E","BI 1.45 E","BI 1.45 E","BI 1.45 E","BI 1.45 E","BI 1.45 E","BI 1.45 E","BI 1.45 E","BI 1.45 E","BI 1.45 E","BI 1.45 E","BI 1.45 E","BI 1.45 E","BI 1.45 E","BI 1.45 E","BI 1.45 E","BI 1.45 E","BI 1.45 E","BI 1.45 E","BI 1.45 E","BI 1.45 E","BI 1.45 E","BI 1.45 E","BI 1.45 E","BI 1.45 E","BI 1.45 E","BI 1.45 E","BI 1.45 E","BI 1.45 E","BI 1.45 E","BI 1.45 E","BI 1.45 E","BI 1.45 E","BI 1.45 E","BI 1.45 E","BI 1.45 E","BI 1.45 E","BI 1.45 E","BI 1.45 E","BI 1.45 E","BI 1.45 E","BI 1.45 E"]
["PAGE4","CheckBox67","пусто",null,{"$f":"F206","v":"пусто "},{"$f":"IFERROR(CONCATENATE(C206,\" \",INDEX(Наименования!B:B,MATCH(C206,Наименования!A:A,0))),\"пусто\")","v":"пусто "},null,null,null,"",1,"Шина зануления 15х5х450","BI 1.45 N","BI 1.45 N","BI 1.45 N","BI 1.45 N","BI 1.45 N","BI 1.45 N","BI 1.45 N","BI 1.45 N","BI 1.45 N","BI 1.45 N","BI 1.45 N","BI 1.45 N","BI 1.45 N","BI 1.45 N","BI 1.45 N","BI 1.45 N","BI 1.45 N","BI 1.45 N","BI 1.45 N","BI 1.45 N","BI 1.45 N","BI 1.45 N","BI 1.45 N","BI 1.45 N","BI 1.45 N","BI 1.45 N","BI 1.45 N","BI 1.45 N","BI 1.45 N","BI 1.45 N","BI 1.45 N","BI 1.45 N","BI 1.45 N","BI 1.45 N","BI 1.45 N","BI 1.45 N","BI 1.45 N","BI 1.45 N","BI 1.45 N","BI 1.45 N","BI 1.45 N","BI 1.45 N","BI 1.45 N","BI 1.45 N","BI 1.45 N","BI 1.45 N","BI 1.45 N","BI 1.45 N","BI 1.45 N","BI 1.45 N"]
["PAGE4","CheckBox68",{"$f":"IFERROR(INDEX(C208:C213,G207),\"пусто\")","v":"пусто"},null,null,null,{"$f":"MATCH(E208,D208:D213,0)","v":{"$error":"#N/A"}},null,null,"",1,"Комплект проводов заземления"]
["PAGE4","ComboBox29_1",{"$f":"IFERROR(INDEX(M208:BJ208,1,$A$5),\"пусто\")","v":"пусто"},{"$f":"CONCATENATE(C208,\" \",INDEX(Наименования!B:B,MATCH(MPx_Add!C208,Наименования!A:A,0)))","v":"пусто "},"W 6.04.8.200 Провода заземления 200мм М6-М8 4мм² 10шт",null,false,null,null,null,1,"200мм М6-М6 4мм2","W 6.04.6.200","W 6.04.6.200","W 6.04.6.200","W 6.04.6.200","W 6.04.6.200","W 6.04.6.200","W 6.04.6.200","W 6.04.6.200","W 6.04.6.200","W 6.04.6.200","W 6.04.6.200","W 6.04.6.200","W 6.04.6.200","W 6.04.6.200","W 6.04.6.200","W 6.04.6.200","W 6.04.6.200","W 6.04.6.200","W 6.04.6.200","W 6.04.6.200","W 6.04.6.200","W 6.04.6.200","W 6.04.6.200","W 6.04.6.200","W 6.04.6.200","W 6.04.6.200","W 6.04.6.200","W 6.04.6.200","W 6.04.6.200","W 6.04.6.200","W 6.04.6.200","W 6.04.6.200","W 6.04.6.200","W 6.04.6.200","W 6.04.6.200","W 6.04.6.200","W 6.04.6.200","W 6.04.6.200","W 6.04.6.200","W 6.04.6.200","W 6.04.6.200","W 6.04.6.200","W 6.04.6.200","W 6.04.6.200","W 6.04.6.200","W 6.04.6.200","W 6.04.6.200","W 6.04.6.200","W 6.04.6.200","W 6.04.6.200"]
["PAGE4","ComboBox29_2","пусто",{"$f":"CONCATENATE(C209,\" \",INDEX(Наименования!B:B,MATCH(MPx_Add!C209,Наименования!A:A,0)))","v":"пусто "},null,null,false,null,null,null,1,"200мм М6-М8 4мм2","W 6.04.8.200","W 6.04.8.200","W 6.04.8.200","W 6.04.8.200","W 6.04.8.200","W 6.04.8.200","W 6.04.8.200","W 6.04.8.200","W 6.04.8.200","W 6.04.8.200","W 6.04.8.200","W 6.04.8.200","W 6.04.8.200","W 6.04.8.200","W 6.04.8.200","W 6.04.8.200","W 6.04.8.200","W 6.04.8.200","W 6.04.8.200","W 6.04.8.200","W 6.04.8.200","W 6.04.8.200","W 6.04.8.200","W 6.04.8.200","W 6.04.8.200","W 6.04.8.200","W 6.04.8.200","W 6.04.8.200","W 6.04.8.200","W 6.04.8.200","W 6.04.8.200","W 6.04.8.200","W 6.04.8.200","W 6.04.8.200","W 6.04.8.200","W 6.04.8.200","W 6.04.8.200","W 6.04.8.200","W 6.04.8.200","W 6.04.8.200","W 6.04.8.200","W 6.04.8.200","W 6.04.8.200","W 6.04.8.200","W 6.04.8.200","W 6.04.8.200","W 6.04.8.200","W 6.04.8.200","W 6.04.8.200","W 6.04.8.200"]
["PAGE4","ComboBox29_3","пусто",{"$f":"CONCATENATE(C210,\" \",INDEX(Наименования!B:B,MATCH(MPx_Add!C210,Наименования!A:A,0)))","v":"пусто "},null,null,false,null,null,null,1,"300мм М6-М8 4мм2","W 6.04.8.300","W 6.04.8.300","W 6.04.8.300","W 6.04.8.300","W 6.04.8.300","W 6.04.8.300","W 6.04.8.300","W 6.04.8.300","W 6.04.8.300","W 6.04.8.300","W 6.04.8.300","W 6.04.8.300","W 6.04.8.300","W 6.04.8.300","W 6.04.8.300","W 6.04.8.300","W 6.04.8.300","W 6.04.8.300","W 6.04.8.300","W 6.04.8.300","W 6.04.8.300","W 6.04.8.300","W 6.04.8.300","W 6.04.8.300","W 6.04.8.300","W 6.04.8.300","W 6.04.8.300","W 6.04.8.300","W 6.04.8.300","W 6.04.8.300","W 6.04.8.300","W 6.04.8.300","W 6.04.8.300","W 6.04.8.300","W 6.04.8.300","W 6.04.8.300","W 6.04.8.300","W 6.04.8.300","W 6.04.8.300","W 6.04.8.300","W 6.04.8.300","W 6.04.8.300","W 6.04.8.300","W 6.04.8.300","W 6.04.8.300","W 6.04.8.300","W 6.04.8.300","W 6.04.8.300","W 6.04.8.300","W 6.04.8.300"]
["PAGE4","ComboBox29_4","пусто",{"$f":"CONCATENATE(C211,\" \",INDEX(Наименования!B:B,MATCH(MPx_Add!C211,Наименования!A:A,0)))","v":"пусто "},null,null,false,null,null,null,1,"300мм М8-М8 10мм2","W 8.10.8.300","W 8.10.8.300","W 8.10.8.300","W 8.10.8.300","W 8.10.8.300","W 8.10.8.300","W 8.10.8.300","W 8.10.8.300","W 8.10.8.300","W 8.10.8.300","W 8.10.8.300","W 8.10.8.300","W 8.10.8.300","W 8.10.8.300","W 8.10.8.300","W 8.10.8.300","W 8.10.8.300","W 8.10.8.300","W 8.10.8.300","W 8.10.8.300","W 8.10.8.300","W 8.10.8.300","W 8.10.8.300","W 8.10.8.300","W 8.10.8.300","W 8.10.8.300","W 8.10.8.300","W 8.10.8.300","W 8.10.8.300","W 8.10.8.300","W 8.10.8.300","W 8.10.8.300","W 8.10.8.300","W 8.10.8.300","W 8.10.8.300","W 8.10.8.300","W 8.10.8.300","W 8.10.8.300","W 8.10.8.300","W 8.10.8.300","W 8.10.8.300","W 8.10.8.300","W 8.10.8.300","W 8.10.8.300","W 8.10.8.300","W 8.10.8.300","W 8.10.8.300","W 8.10.8.300","W 8.10.8.300","W 8.10.8.300"]
["PAGE4","ComboBox29_5","пусто",{"$f":"CONCATENATE(C212,\" \",INDEX(Наименования!B:B,MATCH(MPx_Add!C212,Наименования!A:A,0)))","v":"пусто "},null,null,false,null,null,null,1,"400мм М6-М6 4мм2","W 6.04.6.400","W 6.04.6.400","W 6.04.6.400","W 6.04.6.400","W 6.04.6.400","W 6.04.6.400","W 6.04.6.400","W 6.04.6.400","W 6.04.6.400","W 6.04.6.400","W 6.04.6.400","W 6.04.6.400","W 6.04.6.400","W 6.04.6.400","W 6.04.6.400","W 6.04.6.400","W 6.04.6.400","W 6.04.6.400","W 6.04.6.400","W 6.04.6.400","W 6.04.6.400","W 6.04.6.400","W 6.04.6.400","W 6.04.6.400","W 6.04.6.400","W 6.04.6.400","W 6.04.6.400","W 6.04.6.400","W 6.04.6.400","W 6.04.6.400","W 6.04.6.400","W 6.04.6.400","W 6.04.6.400","W 6.04.6.400","W 6.04.6.400","W 6.04.6.400","W 6.04.6.400","W 6.04.6.400","W 6.04.6.400","W 6.04.6.400","W 6.04.6.400","W 6.04.6.400","W 6.04.6.400","W 6.04.6.400","W 6.04.6.400","W 6.04.6.400","W 6.04.6.400","W 6.04.6.400","W 6.04.6.400","W 6.04.6.400"]
["PAGE4","ComboBox29_6","пусто","Нет",null,null,false,null,null,null,1,"нет","Нет","Нет","Нет","Нет","Нет","Нет","Нет","Нет","Нет","Нет","Нет","Нет","Нет","Нет","Нет","Нет","Нет","Нет","Нет","Нет","Нет","Нет","Нет","Нет","Нет","Нет","Нет","Нет","Нет","Нет","Нет","Нет","Нет","Нет","Нет","Нет","Нет","Нет","Нет","Нет","Нет","Нет","Нет","Нет","Нет","Нет","Нет","Нет","Нет","Нет"]
["PAGE4","CheckBox69",{"$f":"IFERROR(INDEX(C215:C221,G214),\"пусто\")","v":"пусто"},null,null,null,{"$f":"MATCH(E215,D215:D221,0)","v":{"$error":"#N/A"}},null,null,{"$f":"IFERROR(IF(I214,C214,\"\"),\"\")","v":""},1,"светильник светодиодный"]
["PAGE4","ComboBox30_1",{"$f":"IFERROR(INDEX(M215:BJ215,1,$A$5),\"пусто\")","v":"пусто"},{"$f":"CONCATENATE(C215,\" \",INDEX(Наименования!B:B,MATCH(MPx_Add!C215,Наименования!A:A,0)))","v":"пусто "},"LA 5 LED M Светильник LED 5 Вт, 290 лм, 351х34х32мм 100-240В с магнитным креплением 1шт",null,false,null,null,null,1,"LA 5 LED M","LA 5 LED M","LA 5 LED M","LA 5 LED M","LA 5 LED M","LA 5 LED M","LA 5 LED M","LA 5 LED M","LA 5 LED M","LA 5 LED M","LA 5 LED M","LA 5 LED M","LA 5 LED M","LA 5 LED M","LA 5 LED M","LA 5 LED M","LA 5 LED M","LA 5 LED M","LA 5 LED M","LA 5 LED M","LA 5 LED M","LA 5 LED M","LA 5 LED M","LA 5 LED M","LA 5 LED M","LA 5 LED M","LA 5 LED M","LA 5 LED M","LA 5 LED M","LA 5 LED M","LA 5 LED M","LA 5 LED M","LA 5 LED M","LA 5 LED M","LA 5 LED M","LA 5 LED M","LA 5 LED M","LA 5 LED M","LA 5 LED M","LA 5 LED M","LA 5 LED M","LA 5 LED M","LA 5 LED M","LA 5 LED M","LA 5 LED M","LA 5 LED M","LA 5 LED M","LA 5 LED M","LA 5 LED M","LA 5 LED M","LA 5 LED M"]
["PAGE4","ComboBox30_2","пусто",{"$f":"CONCATENATE(C216,\" \",INDEX(Наименования!B:B,MATCH(MPx_Add!C216,Наименования!A:A,0)))","v":"пусто "},null,null,false,null,null,null,1,"LED 025","LED 025","LED 025","LED 025","LED 025","LED 025","LED 025","LED 025","LED 025","LED 025","LED 025","LED 025","LED 025","LED 025","LED 025","LED 025","LED 025","LED 025","LED 025","LED 025","LED 025","LED 025","LED 025","LED 025","LED 025","LED 025","LED 025","LED 025","LED 025","LED 025","LED 025","LED 025","LED 025","LED 025","LED 025","LED 025","LED 025","LED 025","LED 025","LED 025","LED 025","LED 025","LED 025","LED 025","LED 025","LED 025","LED 025","LED 025","LED 025","LED 025","LED 025"]
["PAGE4","ComboBox30_3","пусто",{"$f":"CONCATENATE(C217,\" \",INDEX(Наименования!B:B,MATCH(MPx_Add!C217,Наименования!A:A,0)))","v":"пусто "},null,null,false,null,null,null,1,"LED 025 PIR","LED 025 PIR","LED 025 PIR","LED 025 PIR","LED 025 PIR","LED 025 PIR","LED 025 PIR","LED 025 PIR","LED 025 PIR","LED 025 PIR","LED 025 PIR","LED 025 PIR","LED 025 PIR","LED 025 PIR","LED 025 PIR","LED 025 PIR","LED 025 PIR","LED 025 PIR","LED 025 PIR","LED 025 PIR","LED 025 PIR","LED 025 PIR","LED 025 PIR","LED 025 PIR","LED 025 PIR","LED 025 PIR","LED 025 PIR","LED 025 PIR","LED 025 PIR","LED 025 PIR","LED 025 PIR","LED 025 PIR","LED 025 PIR","LED 025 PIR","LED 025 PIR","LED 025 PIR","LED 025 PIR","LED 025 PIR","LED 025 PIR","LED 025 PIR","LED 025 PIR","LED 025 PIR","LED 025 PIR","LED 025 PIR","LED 025 PIR","LED 025 PIR","LED 025 PIR","LED 025 PIR","LED 025 PIR","LED 025 PIR","LED 025 PIR"]
["PAGE4","ComboBox30_4","пусто",{"$f":"CONCATENATE(C218,\" \",INDEX(Наименования!B:B,MATCH(MPx_Add!C218,Наименования!A:A,0)))","v":"пусто "},null,null,false,null,null,null,1,"LA 5 LED S","LA 5 LED S","LA 5 LED S","LA 5 LED S","LA 5 LED S","LA 5 LED S","LA 5 LED S","LA 5 LED S","LA 5 LED S","LA 5 LED S","LA 5 LED S","LA 5 LED S","LA 5 LED S","LA 5 LED S","LA 5 LED S","LA 5 LED S","LA 5 LED S","LA 5 LED S","LA 5 LED S","LA 5 LED S","LA 5 LED S","LA 5 LED S","LA 5 LED S","LA 5 LED S","LA 5 LED S","LA 5 LED S","LA 5 LED S","LA 5 LED S","LA 5 LED S","LA 5 LED S","LA 5 LED S","LA 5 LED S","LA 5 LED S","LA 5 LED S","LA 5 LED S","LA 5 LED S","LA 5 LED S","LA 5 LED S","LA 5 LED S","LA 5 LED S","LA 5 LED S","LA 5 LED S","LA 5 LED S","LA 5 LED S","LA 5 LED S","LA 5 LED S","LA 5 LED S","LA 5 LED S","LA 5 LED S","LA 5 LED S","LA 5 LED S"]
["PAGE4","ComboBox30_5","пусто",{"$f":"CONCATENATE(C219,\" \",INDEX(Наименования!B:B,MATCH(MPx_Add!C219,Наименования!A:A,0)))","v":"пусто "},null,null,false,null,null,null,1,"LA 5 LED","LA 5 LED","LA 5 LED","LA 5 LED","LA 5 LED","LA 5 LED","LA 5 LED","LA 5 LED","LA 5 LED","LA 5 LED","LA 5 LED","LA 5 LED","LA 5 LED","LA 5 LED","LA 5 LED","LA 5 LED","LA 5 LED","LA 5 LED","LA 5 LED","LA 5 LED","LA 5 LED","LA 5 LED","LA 5 LED","LA 5 LED","LA 5 LED","LA 5 LED","LA 5 LED","LA 5 LED","LA 5 LED","LA 5 LED","LA 5 LED","LA 5 LED","LA 5 LED","LA 5 LED","LA 5 LED","LA 5 LED","LA 5 LED","LA 5 LED","LA 5 LED","LA 5 LED","LA 5 LED","LA 5 LED","LA 5 LED","LA 5 LED","LA 5 LED","LA 5 LED","LA 5 LED","LA 5 LED","LA 5 LED","LA 5 LED","LA 5 LED"]
["PAGE4","ComboBox30_6","пусто",{"$f":"CONCATENATE(C220,\" \",INDEX(Наименования!B:B,MATCH(MPx_Add!C220,Наименования!A:A,0)))","v":"пусто "},null,null,false,null,null,null,1,"LA 5.024 LED M","LA 5.024 LED M","LA 5.024 LED M","LA 5.024 LED M","LA 5.024 LED M","LA 5.024 LED M","LA 5.024 LED M","LA 5.024 LED M","LA 5.024 LED M","LA 5.024 LED M","LA 5.024 LED M","LA 5.024 LED M","LA 5.024 LED M","LA 5.024 LED M","LA 5.024 LED M","LA 5.024 LED M","LA 5.024 LED M","LA 5.024 LED M","LA 5.024 LED M","LA 5.024 LED M","LA 5.024 LED M","LA 5.024 LED M","LA 5.024 LED M","LA 5.024 LED M","LA 5.024 LED M","LA 5.024 LED M","LA 5.024 LED M","LA 5.024 LED M","LA 5.024 LED M","LA 5.024 LED M","LA 5.024 LED M","LA 5.024 LED M","LA 5.024 LED M","LA 5.024 LED M","LA 5.024 LED M","LA 5.024 LED M","LA 5.024 LED M","LA 5.024 LED M","LA 5.024 LED M","LA 5.024 LED M","LA 5.024 LED M","LA 5.024 LED M","LA 5.024 LED M","LA 5.024 LED M","LA 5.024 LED M","LA 5.024 LED M","LA 5.024 LED M","LA 5.024 LED M","LA 5.024 LED M","LA 5.024 LED M","LA 5.024 LED M"]
["PAGE4","ComboBox30_7","пусто","Нет",null,null,false,null,null,null,1,"нет","Нет","Нет","Нет","Нет","Нет","Нет","Нет","Нет","Нет","Нет","Нет","Нет","Нет","Нет","Нет","Нет","Нет","Нет","Нет","Нет","Нет","Нет","Нет","Нет","Нет","Нет","Нет","Нет","Нет","Нет","Нет","Нет","Нет","Нет","Нет","Нет","Нет","Нет","Нет","Нет","Нет","Нет","Нет","Нет","Нет","Нет","Нет","Нет","Нет","Нет"]
["PAGE4","CheckBox70","пусто",null,{"$f":"F222","v":"пусто "},{"$f":"IFERROR(CONCATENATE(C222,\" \",INDEX(Наименования!B:B,MATCH(C222,Наименования!A:A,0))),\"пусто\")","v":"пусто "},null,null,null,{"$f":"IFERROR(IF(I222,C222,\"\"),\"\")","v":""},1,"Концевой выключатель","SW 01","SW 01","SW 01","SW 01","SW 01","SW 01","SW 01","SW 01","SW 01","SW 01","SW 01","SW 01","SW 01","SW 01","SW 01","SW 01","SW 01","SW 01","SW 01","SW 01","SW 01","SW 01","SW 01","SW 01","SW 01","SW 01","SW 01","SW 01","SW 01","SW 01","SW 01","SW 01","SW 01","SW 01","SW 01","SW 01","SW 01","SW 01","SW 01","SW 01","SW 01","SW 01","SW 01","SW 01","SW 01","SW 01","SW 01","SW 01","SW 01","SW 01"]
["PAGE4","CheckBox71","пусто",null,{"$f":"F223","v":"пусто "},{"$f":"IFERROR(CONCATENATE(C223,\" \",INDEX(Наименования!B:B,MATCH(C223,Наименования!A:A,0))),\"пусто\")","v":"пусто "},null,null,null,"",1,"Кронштейн светильника на 19\"","MB 05.48 LA","MB 05.48 LA","MB 05.48 LA","MB 05.48 LA","MB 05.48 LA","MB 05.48 LA","MB 05.48 LA","MB 05.48 LA","MB 05.48 LA","MB 05.48 LA","MB 05.48 LA","MB 05.48 LA","MB 05.48 LA","MB 05.48 LA","MB 05.48 LA","MB 05.48 LA","MB 05.48 LA","MB 05.48 LA","MB 05.48 LA","MB 05.48 LA","MB 05.48 LA","MB 05.48 LA","MB 05.48 LA","MB 05.48 LA","MB 05.48 LA","MB 05.48 LA","MB 05.48 LA","MB 05.48 LA","MB 05.48 LA","MB 05.48 LA","MB 05.48 LA","MB 05.48 LA","MB 05.48 LA","MB 05.48 LA","MB 05.48 LA","MB 05.48 LA","MB 05.48 LA","MB 05.48 LA","MB 05.48 LA","MB 05.48 LA","MB 05.48 LA","MB 05.48 LA","MB 05.48 LA","MB 05.48 LA","MB 05.48 LA","MB 05.48 LA","MB 05.48 LA","MB 05.48 LA","MB 05.48 LA","MB 05.48 LA"]
["PAGE4","CheckBox73","пусто",null,{"$f":"F224","v":"пусто "},{"$f":"IFERROR(CONCATENATE(C224,\" \",INDEX(Наименования!B:B,MATCH(C224,Наименования!A:A,0))),\"пусто\")","v":"пусто "},null,null,null,"",1,"Винт самонарезной 5,5х13","S 5.11","S 5.11","S 5.11","S 5.11","S 5.11","S 5.11","S 5.11","S 5.11","S 5.11","S 5.11","S 5.11","S 5.11","S 5.11","S 5.11","S 5.11","S 5.11","S 5.11","S 5.11","S 5.11","S 5.11","S 5.11","S 5.11","S 5.11","S 5.11","S 5.11","S 5.11","S 5.11","S 5.11","S 5.11","S 5.11","S 5.11","S 5.11","S 5.11","S 5.11","S 5.11","S 5.11","S 5.11","S 5.11","S 5.11","S 5.11","S 5.11","S 5.11","S 5.11","S 5.11","S 5.11","S 5.11","S 5.11","S 5.11","S 5.11","S 5.11"]
["PAGE4","CheckBox74","пусто",null,{"$f":"F225","v":"пусто "},{"$f":"IFERROR(CONCATENATE(C225,\" \",INDEX(Наименования!B:B,MATCH(C225,Наименования!A:A,0))),\"пусто\")","v":"пусто "},null,null,null,"",1,"Гайка закладная М6 фиксации 19\" 100шт","N 6 MS","N 6 MS","N 6 MS","N 6 MS","N 6 MS","N 6 MS","N 6 MS","N 6 MS","N 6 MS","N 6 MS","N 6 MS","N 6 MS","N 6 MS","N 6 MS","N 6 MS","N 6 MS","N 6 MS","N 6 MS","N 6 MS","N 6 MS","N 6 MS","N 6 MS","N 6 MS","N 6 MS","N 6 MS","N 6 MS","N 6 MS","N 6 MS","N 6 MS","N 6 MS","N 6 MS","N 6 MS","N 6 MS","N 6 MS","N 6 MS","N 6 MS","N 6 MS","N 6 MS","N 6 MS","N 6 MS","N 6 MS","N 6 MS","N 6 MS","N 6 MS","N 6 MS","N 6 MS","N 6 MS","N 6 MS","N 6 MS","N 6 MS"]
["PAGE4","CheckBox75","пусто",null,{"$f":"F226","v":"пусто "},{"$f":"IFERROR(CONCATENATE(C226,\" \",INDEX(Наименования!B:B,MATCH(C226,Наименования!A:A,0))),\"пусто\")","v":"пусто "},null,null,null,"",1,"Винт М6х16мм фиксации 19\" с крестообразным шлицем 100шт","S 6.16 M","S 6.16 M","S 6.16 M","S 6.16 M","S 6.16 M","S 6.16 M","S 6.16 M","S 6.16 M","S 6.16 M","S 6.16 M","S 6.16 M","S 6.16 M","S 6.16 M","S 6.16 M","S 6.16 M","S 6.16 M","S 6.16 M","S 6.16 M","S 6.16 M","S 6.16 M","S 6.16 M","S 6.16 M","S 6.16 M","S 6.16 M","S 6.16 M","S 6.16 M","S 6.16 M","S 6.16 M","S 6.16 M","S 6.16 M","S 6.16 M","S 6.16 M","S 6.16 M","S 6.16 M","S 6.16 M","S 6.16 M","S 6.16 M","S 6.16 M","S 6.16 M","S 6.16 M","S 6.16 M","S 6.16 M","S 6.16 M","S 6.16 M","S 6.16 M","S 6.16 M","S 6.16 M","S 6.16 M","S 6.16 M","S 6.16 M"]
["PAGE4","CheckBox76",{"$f":"IFERROR(INDEX(C228:C230,G227),\"пусто\")","v":"пусто"},null,null,null,{"$f":"MATCH(E228,D228:D230,0)","v":{"$error":"#N/A"}},null,null,"",1,"МП малая"]
["PAGE4","ComboBox31_1",{"$f":"IFERROR(INDEX(M228:BJ228,1,$A$5),\"пусто\")","v":"пусто"},{"$f":"CONCATENATE(C228,\" \",INDEX(Наименования!B:B,MATCH(MPx_Add!C228,Наименования!A:A,0)))","v":"пусто "},null,null,false,null,null,null,1,"МП 30х103мм угловая","MP 03.10 PL","MP 03.10 PL","MP 03.10 PL","MP 03.10 PL","MP 03.10 PL","MP 03.10 PL","MP 03.10 PL","MP 03.10 PL","MP 03.10 PL","MP 03.10 PL","MP 03.10 PL","MP 03.10 PL","MP 03.10 PL","MP 03.10 PL","MP 03.10 PL","MP 03.10 PL","MP 03.10 PL","MP 03.10 PL","MP 03.10 PL","MP 03.10 PL","MP 03.10 PL","MP 03.10 PL","MP 03.10 PL","MP 03.10 PL","MP 03.10 PL","MP 03.10 PL","MP 03.10 PL","MP 03.10 PL","MP 03.10 PL","MP 03.10 PL","MP 03.10 PL","MP 03.10 PL","MP 03.10 PL","MP 03.10 PL","MP 03.10 PL","MP 03.10 PL","MP 03.10 PL","MP 03.10 PL","MP 03.10 PL","MP 03.10 PL","MP 03.10 PL","MP 03.10 PL","MP 03.10 PL","MP 03.10 PL","MP 03.10 PL","MP 03.10 PL","MP 03.10 PL","MP 03.10 PL","MP 03.10 PL","MP 03.10 PL"]
["PAGE4","ComboBox31_2",{"$f":"IFERROR(INDEX(M229:BJ229,1,$A$5),\"пусто\")","v":"пусто"},{"$f":"CONCATENATE(C229,\" \",INDEX(Наименования!B:B,MATCH(MPx_Add!C229,Наименования!A:A,0)))","v":"пусто "},null,null,false,null,null,null,1,"МП 60х103мм угловая","MP 06.10 PL","MP 06.10 PL","MP 06.10 PL","MP 06.10 PL","MP 06.10 PL","MP 06.10 PL","MP 06.10 PL","MP 06.10 PL","MP 06.10 PL","MP 06.10 PL","MP 06.10 PL","MP 06.10 PL","MP 06.10 PL","MP 06.10 PL","MP 06.10 PL","MP 06.10 PL","MP 06.10 PL","MP 06.10 PL","MP 06.10 PL","MP 06.10 PL","MP 06.10 PL","MP 06.10 PL","MP 06.10 PL","MP 06.10 PL","MP 06.10 PL","MP 06.10 PL","MP 06.10 PL","MP 06.10 PL","MP 06.10 PL","MP 06.10 PL","MP 06.10 PL","MP 06.10 PL","MP 06.10 PL","MP 06.10 PL","MP 06.10 PL","MP 06.10 PL","MP 06.10 PL","MP 06.10 PL","MP 06.10 PL","MP 06.10 PL","MP 06.10 PL","MP 06.10 PL","MP 06.10 PL","MP 06.10 PL","MP 06.10 PL","MP 06.10 PL","MP 06.10 PL","MP 06.10 PL","MP 06.10 PL","MP 06.10 PL"]
["PAGE4","ComboBox31_3",{"$f":"IFERROR(INDEX(M230:BJ230,1,$A$5),\"пусто\")","v":"пусто"},"Нет",null,null,false,null,null,null,1,"нет","Нет","Нет","Нет","Нет","Нет","Нет","Нет","Нет","Нет","Нет","Нет","Нет","Нет","Нет","Нет","Нет","Нет","Нет","Нет","Нет","Нет","Нет","Нет","Нет","Нет","Нет","Нет","Нет","Нет","Нет","Нет","Нет","Нет","Нет","Нет","Нет","Нет","Нет","Нет","Нет","Нет","Нет","Нет","Нет","Нет","Нет","Нет","Нет","Нет","Нет"]

{"sheet":"Наименования","index":2,"n_rows":624,"n_cols":4,"rows_kept":624,"cut":false,"hidden":true,"merged":[]}
["Характеристика","Наименование для конфигуратора","Компл.пост.","Ед.изм"]
["DR 07.125","DIN-рейка 35х7,5х125мм для ширины 200мм 10шт",null,"уп."]
["DR 07.2000","DIN-рейка 35х7,5х2000мм 10шт",null,"уп."]
["DR 07.225","DIN-рейка 35х7,5х225мм для шкафа шириной 300мм 10шт",null,"уп."]
["DR 07.325","DIN-рейка 35х7,5х325мм для шкафа шириной 400мм 10шт",null,"уп."]
["DR 07.525","DIN-рейка 35х7,5х525мм для шкафа шириной 600мм 10шт",null,"уп."]
["DR 07.725","DIN-рейка 35х7,5х725мм для шкафа шириной 800мм 10шт",null,"уп."]
["DR 15.125","DIN-рейка 35х15х125мм для шкафа шириной 200мм 10шт",null,"уп."]
["DR 15.2000","DIN-рейка 35х15х2000мм 10шт",null,"уп."]
["DR 15.225","DIN-рейка 35х15х225мм для шкафа шириной 300мм 10шт",null,"уп."]
["DR 15.325","DIN-рейка 35х15х325мм для шкафа шириной 400мм 10шт",null,"уп."]
["DR 15.525","DIN-рейка 35х15х525мм для шкафа шириной 600мм 10шт",null,"уп."]
["DR 15.725","DIN-рейка 35х15х725мм для шкафа шириной 800мм 10шт",null,"уп."]
["ZA 00.40 K v.2","Боковые панели цоколя 100х400мм с щеточным вводом 2шт",null,"уп."]
["ZA 00.60 K v.2","Боковые панели цоколя 100х600мм с щеточным вводом 2шт",null,"уп."]
["ZA 00.80 K v.2","Боковые панели цоколя 100х800мм с щеточным вводом 2шт",null,"уп."]
["ZA 00.25 v.2","Боковые панели цоколя 100х250мм 2шт",null,"уп."]
["ZA 00.30 v.2","Боковые панели цоколя 100х300мм 2шт",null,"уп."]
["ZA 00.40 H v.2","Боковые панели цоколя 200х400мм 2шт",null,"уп."]
["ZA 00.40 v.2","Боковые панели цоколя 100х400мм 2шт",null,"уп."]
["ZA 00.50 H v.2","Боковые панели цоколя 200х500мм 2шт",null,"уп."]
["ZA 00.50 v.2","Боковые панели цоколя 100х500мм 2шт",null,"уп."]
["ZA 00.60 H v.2","Боковые панели цоколя 200х600мм 2шт",null,"уп."]
["ZA 00.60 v.2","Боковые панели цоколя 100х600мм 2шт",null,"уп."]
["ZA 00.80 H v.2","Боковые панели цоколя 200х800мм 2шт",null,"уп."]
["ZA 00.80 v.2","Боковые панели цоколя 100х800мм 2шт",null,"уп."]
["GK 13.8","Кабельный ввод для 8 кабелей диаметром 13мм 25шт",null,"уп."]
["GK 21.3","Кабельный ввод для 3 кабелей диаметром 21мм 25шт",null,"уп."]
["GK 47.1","Кабельный ввод для 1 кабеля диаметром 47мм 25шт",null,"уп."]
["GK 21 PG","Кабельный ввод PG21 полиамид RAL7035 15шт",null,"уп."]
["GK 32 M","Кабельный ввод М32 полиамид RAL7035 15шт",null,"уп."]
["GK 16 PG","Кабельный ввод PG16 полиамид RAL7035 25шт",null,"уп."]
["GK 25 M","Кабельный ввод М25 полиамид RAL7035 25шт",null,"уп."]
["GK 09 PG","Кабельный ввод PG9 полиамид RAL7035 50шт",null,"уп."]
["GK 11 PG","Кабельный ввод PG11 полиамид RAL7035 50шт",null,"уп."]
["GK 12 M","Кабельный ввод М12 полиамид RAL7035 50шт",null,"уп."]
["GK 13 PG","Кабельный ввод PG13 полиамид RAL7035 50шт",null,"уп."]
["GK 16 M","Кабельный ввод М16 полиамид RAL7035 50шт",null,"уп."]
["GK 20 M","Кабельный ввод М20 полиамид RAL7035 50шт",null,"уп."]
["GK 29 PG","Кабельный ввод PG29 полиамид RAL7035 5шт",null,"уп."]
["GK 36 PG","Кабельный ввод PG36 полиамид RAL7035 5шт",null,"уп."]
["GK 40 M","Кабельный ввод М40 полиамид RAL7035 5шт",null,"уп."]
["GK 50 M","Кабельный ввод М50 полиамид RAL7035 5шт",null,"уп."]
["G 35.3 B","Кабельный ввод щеточный плоский 350мм 2шт",null,"уп."]
["G 48.3 B","Кабельный ввод щеточный плоский 480мм 2шт",null,"уп."]
["G 68.3 B","Кабельный ввод щеточный плоский 680мм 2шт",null,"уп."]
["G 50.4 B","Кабельный ввод щеточный угловой для шкафа шириной 1000мм 2шт",null,"уп."]
["G 60.4 B","Кабельный ввод щеточный угловой для шкафа шириной 600/1200мм 2шт",null,"уп."]
["G 80.4 B","Кабельный ввод щеточный угловой для шкафа шириной 800мм 2шт",null,"уп."]
["S 6.16 M","Винт М6х16мм фиксации 19\" с крестообразным шлицем 100шт",null,"уп."]
["S 5.13 T","Винт самонарезающий 5,5х13мм TX25 100шт",null,"уп."]
["SW 01","Концевой выключатель 6А перекидной 1шт",null,"шт."]
["N 6 MS","Гайка закладная М6 фиксации 19\" 100шт",null,"уп."]
["D 120.60","Дверь шкафа MPx одностворчатая 1200х600мм 1шт",null,"шт."]
["D 120.80","Дверь шкафа MPx одностворчатая 1200х800мм 1шт",null,"шт."]
["D 140.60","Дверь шкафа MPx одностворчатая 1400х600мм 1шт",null,"шт."]
["D 160.60","Дверь шкафа MPx одностворчатая 1600х600мм 1шт",null,"шт."]
["D 160.80","Дверь шкафа MPx одностворчатая 1600х800мм 1шт",null,"шт."]
["D 180.100 D","Дверь шкафа MPx двухстстворчатая 1800х1000мм 1шт",null,"шт."]
["D 180.120 D","Дверь шкафа MPx двухстстворчатая 1800х1200мм 1шт",null,"шт."]
["D 180.40","Дверь шкафа MPx одностворчатая 1800х400мм 1шт",null,"шт."]
["D 180.60","Дверь шкафа MPx одностворчатая 1800х600мм 1шт",null,"шт."]
["D 180.80","Дверь шкафа MPx одностворчатая 1800х800мм 1шт",null,"шт."]
["D 180.80 D","Дверь шкафа MPx двухстворчатая 1800х800мм 1шт",null,"шт."]
["D 200.100 D","Дверь шкафа MPx двухстворчатая 2000х1000мм 1шт",null,"шт."]
["D 200.120 D","Дверь шкафа MPx двухстворчатая 2000х1200мм 1шт",null,"шт."]
["D 200.40","Дверь шкафа MPx одностворчатая 2000х400мм 1шт",null,"шт."]
["D 200.60","Дверь шкафа MPx одностворчатая 2000х600мм 1шт",null,"шт."]
["D 200.60 D","Дверь шкафа MPx двухстворчатая 2000х600мм 1шт",null,"шт."]
["D 200.80","Дверь шкафа MPx одностворчатая 2000х800мм 1шт",null,"шт."]
["D 200.80 D","Дверь шкафа MPx двухстворчатая 2000х800мм 1шт",null,"шт."]
["D 220.100 D","Дверь шкафа MPx двухстворчатая 2200х1000мм 1шт",null,"шт."]
["D 220.120 D","Дверь шкафа MPx двухстворчатая 2200х1200мм 1шт",null,"шт."]
["D 220.40","Дверь шкафа MPx одностворчатая 2200х400мм 1шт",null,"шт."]
["D 220.60","Дверь шкафа MPx одностворчатая 2200х600мм 1шт",null,"шт."]
["D 220.80","Дверь шкафа MPx одностворчатая 2200х800мм 1шт",null,"шт."]
["D 220.80 D","Дверь шкафа MPx двухстворчатая 2200х800мм 1шт",null,"шт."]
["ID 180.60","Дверь шкафа MPx внутренняя 1800х600мм 1шт",null,"шт."]
["ID 180.80","Дверь шкафа MPx внутренняя 1800х800мм 1шт",null,"шт."]
["ID 200.60","Дверь шкафа MPx внутренняя 2000х600мм 1шт",null,"шт."]
["ID 200.80","Дверь шкафа MPx внутренняя 2000х800мм 1шт",null,"шт."]
["ID 220.60","Дверь шкафа MPx внутренняя 2200х600мм 1шт",null,"шт."]
["ID 220.80","Дверь шкафа MPx внутренняя 2200х800мм 1шт",null,"шт."]
["ID 100.60","Дверь шкафа MEx внутренняя 1000х600мм 1шт",null,"шт."]
["ID 100.80","Дверь шкафа MEx внутренняя 1000х800мм 1шт",null,"шт."]
["ID 120.60","Дверь шкафа MEx внутренняя 1200х600мм 1шт",null,"шт."]
["ID 120.80","Дверь шкафа MEx внутренняя 1200х800мм 1шт",null,"шт."]
["ID 140.80","Дверь шкафа MEx внутренняя 1400х800мм 1шт",null,"шт."]
["ID 50.40","Дверь шкафа MEx внутренняя 500х400мм 1шт",null,"шт."]
["ID 60.40","Дверь шкафа MEx внутренняя 600х400мм 1шт",null,"шт."]
["ID 70.50","Дверь шкафа MEx внутренняя 700х500мм 1шт",null,"шт."]
["ID 80.60","Дверь шкафа MEx внутренняя 800х600мм 1шт",null,"шт."]
["D 120.60 V","Дверь шкафа MPx обзорная 1200х600мм 1шт",null,"шт."]
["D 120.80 V","Дверь шкафа MPx обзорная 1200х800мм 1шт",null,"шт."]
["D 160.60 V","Дверь шкафа MPx обзорная 1600х600мм 1шт",null,"шт."]
["D 180.40 V","Дверь шкафа MPx обзорная 1800х400мм 1шт",null,"шт."]
["D 180.60 V","Дверь шкафа MPx обзорная 1800х600мм 1шт",null,"шт."]
["D 180.80 V","Дверь шкафа MPx обзорная 1800х800мм 1шт",null,"шт."]
["D 200.40 V","Дверь шкафа MPx обзорная 2000х400мм 1шт",null,"шт."]
["D 200.60 V","Дверь шкафа MPx обзорная 2000х600мм 1шт",null,"шт."]
["D 200.80 V","Дверь шкафа MPx обзорная 2000х800мм 1шт",null,"шт."]
["D 220.60 V","Дверь шкафа MPx обзорная 2200х600мм 1шт",null,"шт."]
["D 220.80 V","Дверь шкафа MPx обзорная 2200х800мм 1шт",null,"шт."]
["B 6 DR","Держатель DIN-рейки горизонтальный 10шт",null,"уп."]
["B 5.35 DR","Держатель DIN-рейки наклонный 20шт",null,"уп."]
["B 8 MG","Держатель траверс вертикально, горизонтально, под углом правый+левый 6шт",null,"уп."]
["CL 12","Кабельные зажимы 6-12мм С-образных монтажных траверс 25шт",null,"уп."]
["CL 18","Кабельные зажимы 12-18мм С-образных монтажных траверс 25шт",null,"уп."]
["CL 22","Кабельные зажимы 18-22мм С-образных монтажных траверс 25шт",null,"уп."]
["CL 30","Кабельные зажимы 22-30мм С-образных монтажных траверс 25шт",null,"уп."]
["CL 38","Кабельные зажимы 30-38мм С-образных монтажных траверс 25шт",null,"уп."]
["CL 42","Кабельные зажимы 38-42мм С-образных монтажных траверс 25шт",null,"уп."]
["CL 50","Кабельные зажимы 42-50мм С-образных монтажных траверс 25шт",null,"уп."]
["CL 64","Кабельные зажимы 50-64мм С-образных монтажных траверс 25шт",null,"уп."]
["DP 40 M","Карман для документации MPx двери шириной 400мм сталь 1шт",null,"шт."]
["DP 50 M","Карман для документации MPx двери шириной 500мм сталь 1шт",null,"шт."]
["DP 60 M","Карман для документации MPx двери шириной 600мм сталь 1шт",null,"шт."]
["DP 80 M","Карман для документации MPx двери шириной 800мм сталь 1шт",null,"шт."]
["DP 40 P","Карман для документации 220х235х30мм пластик 1шт",null,"шт."]
["R 100.40","Защитный козырек шкафа MPx 1000х400мм 1шт",null,"шт."]
["R 100.60","Защитный козырек шкафа MPx 1000х600мм 1шт",null,"шт."]
["R 100.80","Защитный козырек шкафа MPx 1000х800мм 1шт",null,"шт."]
["R 120.40","Защитный козырек шкафа MPx 1200х400мм 1шт",null,"шт."]
["R 120.50","Защитный козырек шкафа MPx 1200х500мм 1шт",null,"шт."]
["R 120.60","Защитный козырек шкафа MPx 1200х600мм 1шт",null,"шт."]
["R 120.80","Защитный козырек шкафа MPx 1200х800мм 1шт",null,"шт."]
["R 160.60","Защитный козырек шкафа MPx 1600х600мм 1шт",null,"шт."]
["R 60.40","Защитный козырек шкафа MPx 600х400мм 1шт",null,"шт."]
["R 60.50","Защитный козырек шкафа MPx 600х500мм 1шт",null,"шт."]
["R 60.60","Защитный козырек шкафа MPx 600х600мм 1шт",null,"шт."]
["R 60.80","Защитный козырек шкафа MPx 600х800мм 1шт",null,"шт."]
["R 80.40","Защитный козырек шкафа MPx 800х400мм 1шт",null,"шт."]
["R 80.50","Защитный козырек шкафа MPx 800х500мм 1шт",null,"шт."]
["R 80.60","Защитный козырек шкафа MPx 800х600мм 1шт",null,"шт."]
["R 80.80","Защитный козырек шкафа MPx 800х800мм 1шт",null,"шт."]
["R 20.15","Защитный козырек шкафа MEx 200х150мм 1шт",null,"шт."]
["R 30.15","Защитный козырек шкафа MEx 300х150мм 1шт",null,"шт."]
["R 30.21","Защитный козырек шкафа MEx 300х210мм 1шт",null,"шт."]
["R 40.15","Защитный козырек шкафа MEx 400х150мм 1шт",null,"шт."]
["R 40.21","Защитный козырек шкафа MEx 400х210мм 1шт",null,"шт."]
["R 40.25","Защитный козырек шкафа MEx 400х250мм 1шт",null,"шт."]
["R 50.21","Защитный козырек шкафа MEx 500х210мм 1шт",null,"шт."]
["R 50.25","Защитный козырек шкафа MEx 500х250мм 1шт",null,"шт."]
["R 60.21","Защитный козырек шкафа MEx 600х210мм 1шт",null,"шт."]
["R 60.25","Защитный козырек шкафа MEx 600х250мм 1шт",null,"шт."]
["R 60.30","Защитный козырек шкафа MEx 600х300мм 1шт",null,"шт."]
["R 80.30","Защитный козырек шкафа MEx 800х300мм 1шт",null,"шт."]
["OK 40 EP","Комплект крепления на столб настенного шкафа MEx шириной 400мм 1шт",null,"шт."]
["OK 50 EP","Комплект крепления на столб настенного шкафа MEx шириной 500мм 1шт",null,"шт."]
["OK 60 EP","Комплект крепления на столб настенного шкафа MEx шириной 600мм 1шт",null,"шт."]
["OK 80 EP","Комплект крепления на столб настенного шкафа MEx шириной 800мм 1шт",null,"шт."]
["B 6 G","Комплект крепления реек 19\" в шкафы MPx шириной 800мм 1шт",null,"уп."]
["LL 12","Кронштейн для транспортировки лиинейки шкафов 2шт",null,"уп."]
["FT 37.60","Накладная дверь с обзорным окном 370х600мм 1шт",null,"шт."]
["FT 37.80","Накладная дверь с обзорным окном 370х800мм 1шт",null,"шт."]
["FT 67.60","Накладная дверь с обзорным окном 670х600мм 1шт",null,"шт."]
["FT 67.80","Накладная дверь с обзорным окном 670х800мм 1шт",null,"шт."]
["SD","Фиксатор двери шкафа MPx 1шт",null,"шт."]
["SD P","Фиксатор двери шкафа MPx для путей эвакуации 1шт",null,"шт."]
["SD 2 v2","Фиксатор двери шкафа MEx 1шт",null,"шт."]
["F 12.40","Регулировочные ножки 40мм шкафов MPx 4шт",null,"уп."]
["SP 120.100","Боковые стенки MPx 1200x1000мм 2шт",null,"уп."]
["SP 120.40","Боковые стенки MPx 1200x400мм 2шт",null,"уп."]
["SP 120.50","Боковые стенки MPx 1200x500мм 2шт",null,"уп."]
["SP 120.60","Боковые стенки MPx 1200x600мм 2шт",null,"уп."]
["SP 120.80","Боковые стенки MPx 1200x800мм 2шт",null,"уп."]
["SP 140.60","Боковые стенки MPx 1400x600мм 2шт",null,"уп."]
["SP 160.40","Боковые стенки MPx 1600x400мм 2шт",null,"уп."]
["SP 160.50","Боковые стенки MPx 1600x500мм 2шт",null,"уп."]
["SP 160.60","Боковые стенки MPx 1600x600мм 2шт",null,"уп."]
["SP 160.80","Боковые стенки MPx 1600x800мм 2шт",null,"уп."]
["SP 180.100","Боковые стенки MPx 1600x1000мм 2шт",null,"уп."]
["SP 180.40","Боковые стенки MPx 1800x400мм 2шт",null,"уп."]
["SP 180.50","Боковые стенки MPx 1800x500мм 2шт",null,"уп."]
["SP 180.60","Боковые стенки MPx 1800x600мм 2шт",null,"уп."]
["SP 180.80","Боковые стенки MPx 1800x800мм 2шт",null,"уп."]
["SP 200.100","Боковые стенки MPx 2000x1000мм 2шт",null,"уп."]
["SP 200.120","Боковые стенки MPx 2000x1200мм 2шт",null,"уп."]
["SP 200.40","Боковые стенки MPx 2000x400мм 2шт",null,"уп."]
["SP 200.50","Боковые стенки MPx 2000x500мм 2шт",null,"уп."]
["SP 200.60","Боковые стенки MPx 2000x600мм 2шт",null,"уп."]
["SP 200.80","Боковые стенки MPx 2000x800мм 2шт",null,"уп."]
["SP 220.100","Боковые стенки MPx 2200x1000мм 2шт",null,"уп."]
["SP 220.120","Боковые стенки MPx 2200x1200мм 2шт",null,"уп."]
["SP 220.40","Боковые стенки MPx 2200x400мм 2шт",null,"уп."]
["SP 220.60","Боковые стенки MPx 2200x600мм 2шт",null,"уп."]
["SP 220.80","Боковые стенки MPx 2200x800мм 2шт",null,"уп."]
["BP 120.60","Задняя стенка MPx 1200x600мм 1шт",null,"шт."]
["BP 120.80","Задняя стенка MPx 1200x800мм 1шт",null,"шт."]
["BP 160.60","Задняя стенка MPx 1600x600мм 1шт",null,"шт."]
["BP 160.80","Задняя стенка MPx 1600x800мм 1шт",null,"шт."]
["BP 180.100","Задняя стенка MPx 1800x1000мм 1шт",null,"шт."]
["BP 180.120","Задняя стенка MPx 1800x1200мм 1шт",null,"шт."]
["BP 180.40","Задняя стенка MPx 1800x400мм 1шт",null,"шт."]
["BP 180.60","Задняя стенка MPx 1800x600мм 1шт",null,"шт."]
["BP 180.80","Задняя стенка MPx 1800x800мм 1шт",null,"шт."]
["BP 200.100","Задняя стенка MPx 2000x1000мм 1шт",null,"шт."]
["BP 200.120","Задняя стенка MPx 2000x1200мм 1шт",null,"шт."]
["BP 200.40","Задняя стенка MPx 2000x400мм 1шт",null,"шт."]
["BP 200.60","Задняя стенка MPx 2000x600мм 1шт",null,"шт."]
["BP 200.80","Задняя стенка MPx 2000x800мм 1шт",null,"шт."]
["BP 220.100","Задняя стенка MPx 2200x1000мм 1шт",null,"шт."]
["BP 220.120","Задняя стенка MPx 2200x1200мм 1шт",null,"шт."]
["BP 220.40","Задняя стенка MPx 2200x400мм 1шт",null,"шт."]
["BP 220.60","Задняя стенка MPx 2200x600мм 1шт",null,"шт."]
["BP 220.80","Задняя стенка MPx 2200x800мм 1шт",null,"шт."]
["PK 15.13","Панель MEx кабельного ввода 147х133мм с метрической разметкой 1шт",null,"шт."]
["PK 25.13","Панель MEx кабельного ввода 247х133мм с метрической разметкой 1шт",null,"шт."]
["PK 35.13","Панель MEx кабельного ввода 347х133мм с метрической разметкой 1шт",null,"шт."]
["PK 45.13","Панель MEx кабельного ввода 447х133мм с метрической разметкой 1шт",null,"шт."]
["PK 55.13","Панель MEx 547х133мм с метрической разметкой 1шт",null,"шт."]
["PK 32.08 P","Панель MPx Ш=1000мм кабельного ввода с вырезами 2шт",null,"уп."]
["PK 42.08 P","Панель MPx Ш=600/1200мм кабельного ввода с вырезами 2шт",null,"уп."]
["PK 62.08 P","Панель MPx Ш=800мм кабельного ввода с вырезами 2шт",null,"уп."]
["MP 120.60","Монтажная панель MPx 1200x600мм 1шт",null,"шт."]
["MP 120.80","Монтажная панель MPx 1200x800мм 1шт",null,"шт."]
["MP 160.60","Монтажная панель MPx 1600x600мм 1шт",null,"шт."]
["MP 160.80","Монтажная панель MPx 1600x800мм 1шт",null,"шт."]
["MP 180.100","Монтажная панель MPx 1800x1000мм 1шт",null,"шт."]
["MP 180.120","Монтажная панель MPx 1800x1200мм 1шт",null,"шт."]
["MP 180.40","Монтажная панель MPx 1800x400мм 1шт",null,"шт."]
["MP 180.60","Монтажная панель MPx 1800x600мм 1шт",null,"шт."]
["MP 180.80","Монтажная панель MPx 1800x800мм 1шт",null,"шт."]
["MP 200.100","Монтажная панель MPx 2000x1000мм 1шт",null,"шт."]
["MP 200.120","Монтажная панель MPx 2000x1200мм 1шт",null,"шт."]
["MP 200.40","Монтажная панель MPx 2000x400мм 1шт",null,"шт."]
["MP 200.60","Монтажная панель MPx 2000x600мм 1шт",null,"шт."]
["MP 200.80","Монтажная панель MPx 2000x800мм 1шт",null,"шт."]
["MP 220.100","Монтажная панель MPx 2200x1000мм 1шт",null,"шт."]
["MP 220.120","Монтажная панель MPx 2200x1200мм 1шт",null,"шт."]
["MP 220.60","Монтажная панель MPx 2200x600мм 1шт",null,"шт."]
["MP 220.80","Монтажная панель MPx 2200x800мм 1шт",null,"шт."]
["MP 180.100 P","Монтажная панель MPx 1800x1000мм микроперфорированная 1шт",null,"шт."]
["MP 180.120 P","Монтажная панель MPx 1800x1200мм микроперфорированная 1шт",null,"шт."]
["MP 180.60 P","Монтажная панель MPx 1800x600мм микроперфорированная 1шт",null,"шт."]
["MP 180.80 P","Монтажная панель MPx 1800x800мм микроперфорированная 1шт",null,"шт."]
["MP 200.100 P","Монтажная панель MPx 2000x1000мм микроперфорированная 1шт",null,"шт."]
["MP 200.120 P","Монтажная панель MPx 2000x1200мм микроперфорированная 1шт",null,"шт."]
["MP 200.60 P","Монтажная панель MPx 2000x600мм микроперфорированная 1шт",null,"шт."]
["MP 200.80 P","Монтажная панель MPx 2000x800мм микроперфорированная 1шт",null,"шт."]
["MP 220.120 P","Монтажная панель MPx 2200x1200мм микроперфорированная 1шт",null,"шт."]
["MP 220.60 P","Монтажная панель MPx 2200x600мм микроперфорированная 1шт",null,"шт."]
["MP 220.80 P","Монтажная панель MPx 2200x800мм микроперфорированная 1шт",null,"шт."]
["MP 160.11","Монтажная панель MPx 1600мм промежуточная 1шт",null,"шт."]
["MP 180.11","Монтажная панель MPx 1800мм промежуточная 1шт",null,"шт."]
["MP 200.11","Монтажная панель MPx 2000мм промежуточная 1шт",null,"шт."]
["MP 220.11","Монтажная панель MPx 2200мм промежуточная 1шт",null,"шт."]
["MP 105.35 M","Монтажная панель MPx 1050х350мм секционная 1шт",null,"шт."]
["MP 105.45 M","Монтажная панель MPx 1050х450мм секционная 1шт",null,"шт."]
["MP 45.15 M","Монтажная панель MPx 450х150мм секционная 1шт",null,"шт."]
["MP 45.25 M","Монтажная панель MPx 450х250мм секционная 1шт",null,"шт."]
["MP 45.35 M","Монтажная панель MPx 450х350мм секционная 1шт",null,"шт."]
["MP 45.55 M","Монтажная панель MPx 450х550мм секционная 1шт",null,"шт."]
["MP 65.110 M","Монтажная панель MPx 650х1100мм секционная 1шт",null,"шт."]
["MP 65.15 M","Монтажная панель MPx 650х150мм секционная 1шт",null,"шт."]
["MP 65.25 M","Монтажная панель MPx 650х250мм секционная 1шт",null,"шт."]
["MP 65.35 M","Монтажная панель MPx 650х350мм секционная 1шт",null,"шт."]
["MP 65.45 M","Монтажная панель MPx 650х450мм секционная 1шт",null,"шт."]
["MP 65.55 M","Монтажная панель MPx 650х550мм секционная 1шт",null,"шт."]
["MP 85.160 M","Монтажная панель MPx 850х1600мм секционная 1шт",null,"шт."]
["MP 85.35 M","Монтажная панель MPx 850х350мм секционная 1шт",null,"шт."]
["MP 85.45 M","Монтажная панель MPx 850х450мм секционная 1шт",null,"шт."]
["MP 45.25 MP","Монтажная панель MPx 450х250мм секционная с перфорацией 9,5х9,5мм 1шт",null,"шт."]
["MP 45.35 MP","Монтажная панель MPx 450х350мм секционная с перфорацией 9,5х9,5мм 1шт",null,"шт."]
["MP 45.55 MP","Монтажная панель MPx 450х550мм секционная с перфорацией 9,5х9,5мм 1шт",null,"шт."]
["MP 65.35 MP","Монтажная панель MPx 650х350мм секционная с перфорацией 9,5х9,5мм 1шт",null,"шт."]
["MP 65.45 MP","Монтажная панель MPx 650х450мм секционная с перфорацией 9,5х9,5мм 1шт",null,"шт."]
["MP 65.55 MP","Монтажная панель MPx 650х550мм секционная с перфорацией 9,5х9,5мм 1шт",null,"шт."]
["MP 03.10 PL","Монтажная панель 30х103мм угловая 8шт",null,"уп."]
["MP 06.10 PL","Монтажная панель 60х103мм угловая 8шт",null,"уп."]
["SP 180.40 N","Разделительная панель MPx 1800х400мм 1шт",null,"шт."]
["SP 180.50 N","Разделительная панель MPx 1800х500мм 1шт",null,"шт."]
["SP 180.60 N","Разделительная панель MPx 1800х600мм 1шт",null,"шт."]
["SP 200.40 N","Разделительная панель MPx 2000х400мм 1шт",null,"шт."]
["SP 200.50 N","Разделительная панель MPx 2000х500мм 1шт",null,"шт."]
["SP 200.60 N","Разделительная панель MPx 2000х600мм 1шт",null,"шт."]
["SP 200.80 N","Разделительная панель MPx 2000х800мм 1шт",null,"шт."]
["SP 220.60 N","Разделительная панель MPx 2200х600мм 1шт",null,"шт."]
["SP 220.80 N","Разделительная панель MPx 2200х800мм 1шт",null,"шт."]
["ZA 100.00 H v.2","Элементы цоколя передний и задний 200х1000мм 2шт",null,"уп."]
["ZA 100.00 v.2","Элементы цоколя передний и задний 100х1000мм 2шт",null,"уп."]
["ZA 120.00 H v.2","Элементы цоколя передний и задний 200х1200мм 2шт",null,"уп."]
["ZA 120.00 v.2","Элементы цоколя передний и задний 100х1200мм 2шт",null,"уп."]
["ZA 160.00 v.2","Элементы цоколя передний и задний 100х1600мм 2шт",null,"уп."]
["ZA 40.00 H v.2","Элементы цоколя передний и задний 200х400мм 2шт",null,"уп."]
["ZA 40.00 v.2","Элементы цоколя передний и задний 100х400мм 2шт",null,"уп."]
["ZA 60.00 H v.2","Элементы цоколя передний и задний 200х600мм 2шт",null,"уп."]
["ZA 60.00 v.2","Элементы цоколя передний и задний 100х600мм 2шт",null,"уп."]
["ZA 80.00 H v.2","Элементы цоколя передний и задний 200х800мм 2шт",null,"уп."]
["ZA 80.00 v.2","Элементы цоколя передний и задний 100х800мм 2шт",null,"уп."]
["GB 40 R","Промежуточная крышка шкафа MPx глубиной 400мм 1шт",null,"шт."]
["GB 50 R","Промежуточная крышка шкафа MPx глубиной 500мм 1шт",null,"шт."]
["GB 60 R","Промежуточная крышка шкафа MPx глубиной 600мм 1шт",null,"шт."]
["GB 80 R","Промежуточная крышка шкафа MPx глубиной 800мм 1шт",null,"шт."]
["IK 80.60 MF","Пластины переходные рамы и цоколя 800х600 мм для выравнивания высоты сварных швов рамы, комп.",null,"уп."]
["SH 50 D","Полка для документации MPx на дверь 500мм 1шт",null,"шт."]
["SH 60 D","Полка для документации MPx на дверь 600мм 1шт",null,"шт."]
["SH 80 D","Полка для документации MPx на дверь 800мм 1шт",null,"шт."]
["CL 10 EMC","Кабельный зажим ЭМС 3-10мм² 10шт",null,"уп."]
["CL 15 EMC","Кабельный зажим ЭМС 4-15мм² 10шт",null,"уп."]
["CL 20 EMC","Кабельный зажим ЭМС 10-20мм² 10шт",null,"уп."]
["CL 28 EMC","Кабельный зажим ЭМС 15-28мм² 10шт",null,"уп."]
["W 6.04.6.200","Провода заземления 200мм М6-М6 4мм² 10шт",null,"уп."]
["W 6.04.6.400","Провода заземления 400мм М6-М6 4мм² 10шт",null,"уп."]
["W 6.04.8.200","Провода заземления 200мм М6-М8 4мм² 10шт",null,"уп."]
["W 6.04.8.300","Провода заземления 300мм М6-М8 4мм² 10шт",null,"уп."]
["W 8.10.8.300","Провода заземления 300мм М8-М8 10мм² 10шт",null,"уп."]
["MF 120.60.60","Рама MPx 1200x600x600мм с потолочной панелью и панелями основания 1шт",null,"шт."]
["MF 120.60.80","Рама MPx 1200x600x800мм с потолочной панелью и панелями основания 1шт",null,"шт."]
["MF 120.80.50","Рама MPx 1200x800x500мм с потолочной панелью и панелями основания 1шт",null,"шт."]
["MF 120.80.60","Рама MPx 1200x800x600мм с потолочной панелью и панелями основания 1шт",null,"шт."]
["MF 120.80.80","Рама MPx 1200x800x800мм с потолочной панелью и панелями основания 1шт",null,"шт."]
["MF 140.60.40","Рама MPx 1400x600x400мм с потолочной панелью и панелями основания 1шт",null,"шт."]
["MF 140.60.60","Рама MPx 1400x600x600мм с потолочной панелью и панелями основания 1шт",null,"шт."]
["MF 160.60.40","Рама MPx 1600x600x400мм с потолочной панелью и панелями основания 1шт",null,"шт."]
["MF 160.60.50","Рама MPx 1600x600x500мм с потолочной панелью и панелями основания 1шт",null,"шт."]
["MF 160.60.60","Рама MPx 1600x600x600мм с потолочной панелью и панелями основания 1шт",null,"шт."]
["MF 160.60.80","Рама MPx 1600x600x800мм с потолочной панелью и панелями основания 1шт",null,"шт."]
["MF 180.100.40","Рама MPx 1800x1000x400мм с потолочной панелью и панелями основания 1шт",null,"шт."]
["MF 180.100.50","Рама MPx 1800x1000x500мм с потолочной панелью и панелями основания 1шт",null,"шт."]
["MF 180.100.60","Рама MPx 1800x1000x600мм с потолочной панелью и панелями основания 1шт",null,"шт."]
["MF 180.120.40","Рама MPx 1800x1200x400мм с потолочной панелью и панелями основания 1шт",null,"шт."]
["MF 180.120.50","Рама MPx 1800x1200x500мм с потолочной панелью и панелями основания 1шт",null,"шт."]
["MF 180.120.60","Рама MPx 1800x1200x600мм с потолочной панелью и панелями основания 1шт",null,"шт."]
["MF 180.40.40","Рама MPx 1800x400x400мм с потолочной панелью и панелями основания 1шт",null,"шт."]
["MF 180.40.50","Рама MPx 1800x400x500мм с потолочной панелью и панелями основания 1шт",null,"шт."]
["MF 180.40.60","Рама MPx 1800x400x600мм с потолочной панелью и панелями основания 1шт",null,"шт."]
["MF 180.60.100","Рама MPx 1800x600x1000мм с потолочной панелью и панелями основания 1шт",null,"шт."]
["MF 180.60.40","Рама MPx 1800x600x400мм с потолочной панелью и панелями основания 1шт",null,"шт."]
["MF 180.60.50","Рама MPx 1800x600x500мм с потолочной панелью и панелями основания 1шт",null,"шт."]
["MF 180.60.60","Рама MPx 1800x600x600мм с потолочной панелью и панелями основания 1шт",null,"шт."]
["MF 180.60.80","Рама MPx 1800x600x800мм с потолочной панелью и панелями основания 1шт",null,"шт."]
["MF 180.80.100","Рама MPx 1800x800x1000мм с потолочной панелью и панелями основания 1шт",null,"шт."]
["MF 180.80.40","Рама MPx 1800x800x400мм с потолочной панелью и панелями основания 1шт",null,"шт."]
["MF 180.80.50","Рама MPx 1800x800x500мм с потолочной панелью и панелями основания 1шт",null,"шт."]
["MF 180.80.60","Рама MPx 1800x800x600мм с потолочной панелью и панелями основания 1шт",null,"шт."]
["MF 180.80.80","Рама MPx 1800x800x800мм с потолочной панелью и панелями основания 1шт",null,"шт."]
["MF 200.100.40","Рама MPx 2000x1000x400мм с потолочной панелью и панелями основания 1шт",null,"шт."]
["MF 200.100.50","Рама MPx 2000x1000x500мм с потолочной панелью и панелями основания 1шт",null,"шт."]
["MF 200.100.60","Рама MPx 2000x1000x600мм с потолочной панелью и панелями основания 1шт",null,"шт."]
["MF 200.100.80","Рама MPx 2000x1000x800мм с потолочной панелью и панелями основания 1шт",null,"шт."]
["MF 200.120.40","Рама MPx 2000x1200x400мм с потолочной панелью и панелями основания 1шт",null,"шт."]
["MF 200.120.50","Рама MPx 2000x1200x500мм с потолочной панелью и панелями основания 1шт",null,"шт."]
["MF 200.120.60","Рама MPx 2000x1200x600мм с потолочной панелью и панелями основания 1шт",null,"шт."]
["MF 200.120.80","Рама MPx 2000x1200x800мм с потолочной панелью и панелями основания 1шт",null,"шт."]
["MF 200.40.40","Рама MPx 2000x400x400мм с потолочной панелью и панелями основания 1шт",null,"шт."]
["MF 200.40.50","Рама MPx 2000x400x500мм с потолочной панелью и панелями основания 1шт",null,"шт."]
["MF 200.40.60","Рама MPx 2000x400x600мм с потолочной панелью и панелями основания 1шт",null,"шт."]
["MF 200.40.80","Рама MPx 2000x400x800мм с потолочной панелью и панелями основания 1шт",null,"шт."]
["MF 200.60.100","Рама MPx 2000x600x1000мм с потолочной панелью и панелями основания 1шт",null,"шт."]
["MF 200.60.120","Рама MPx 2000x600x1200мм с потолочной панелью и панелями основания 1шт",null,"шт."]
["MF 200.60.40","Рама MPx 2000x600x400мм с потолочной панелью и панелями основания 1шт",null,"шт."]
["MF 200.60.50","Рама MPx 2000x600x500мм с потолочной панелью и панелями основания 1шт",null,"шт."]
["MF 200.60.60","Рама MPx 2000x600x600мм с потолочной панелью и панелями основания 1шт",null,"шт."]
["MF 200.60.80","Рама MPx 2000x600x800мм с потолочной панелью и панелями основания 1шт",null,"шт."]
["MF 200.80.40","Рама MPx 2000x800x400мм с потолочной панелью и панелями основания 1шт",null,"шт."]
["MF 200.80.50","Рама MPx 2000x800x500мм с потолочной панелью и панелями основания 1шт",null,"шт."]
["MF 200.80.60","Рама MPx 2000x800x600мм с потолочной панелью и панелями основания 1шт",null,"шт."]
["MF 200.80.80","Рама MPx 2000x800x800мм с потолочной панелью и панелями основания 1шт",null,"шт."]
["MF 220.100.60","Рама MPx 2200x1000x600мм с потолочной панелью и панелями основания 1шт",null,"шт."]
["MF 220.100.80","Рама MPx 2200x1000x800мм с потолочной панелью и панелями основания 1шт",null,"шт."]
["MF 220.120.60","Рама MPx 2200x1200x600мм с потолочной панелью и панелями основания 1шт",null,"шт."]
["MF 220.120.80","Рама MPx 2200x1200x800мм с потолочной панелью и панелями основания 1шт",null,"шт."]
["MF 220.40.40","Рама MPx 2200x400x400мм с потолочной панелью и панелями основания 1шт",null,"шт."]
["MF 220.40.60","Рама MPx 2200x400x600мм с потолочной панелью и панелями основания 1шт",null,"шт."]
["MF 220.40.80","Рама MPx 2200x400x800мм с потолочной панелью и панелями основания 1шт",null,"шт."]
["MF 220.60.100","Рама MPx 2200x600x1000мм с потолочной панелью и панелями основания 1шт",null,"шт."]
["MF 220.60.60","Рама MPx 2200x600x600мм с потолочной панелью и панелями основания 1шт",null,"шт."]
["MF 220.60.80","Рама MPx 2200x600x800мм с потолочной панелью и панелями основания 1шт",null,"шт."]
["MF 220.80.100","Рама MPx 2200x800x1000мм с потолочной панелью и панелями основания 1шт",null,"шт."]
["MF 220.80.40","Рама MPx 2200x800x400мм с потолочной панелью и панелями основания 1шт",null,"шт."]
["MF 220.80.60","Рама MPx 2200x800x600мм с потолочной панелью и панелями основания 1шт",null,"шт."]
["MF 220.80.80","Рама MPx 2200x800x800мм с потолочной панелью и панелями основания 1шт",null,"шт."]
["MC 200.80 ID","Рама 19\" двухсторонняя 40U шкафа MPx 2000х800мм 1шт",null,"шт."]
["MC 200.80 IRP","Рама 19\" поворотная 40U шкафа MPx 2000х800мм 1шт",null,"шт."]
["MC 80.80 IRP","Рама 19\" поворотная 12U шкафа MPx шириной 800мм 1шт",null,"шт."]
["MF 120.60.60 D","Рама MPx 1200x600x600мм с кабельным вводом сверху и панелями основания 1шт",null,"шт."]
["MF 120.80.80 D","Рама MPx 1200x800x800мм с кабельным вводом сверху и панелями основания 1шт",null,"шт."]
["MF 180.120.40 D","Рама MPx 1800x1200x400мм с кабельным вводом сверху и панелями основания 1шт",null,"шт."]
["MF 180.60.100 D","Рама MPx 1800x600x1000мм с кабельным вводом сверху и панелями основания 1шт",null,"шт."]
["MF 180.60.40 D","Рама MPx 1800x600x400мм с кабельным вводом сверху и панелями основания 1шт",null,"шт."]
["MF 180.60.60 D","Рама MPx 1800x600x600мм с кабельным вводом сверху и панелями основания 1шт",null,"шт."]
["MF 180.60.80 D","Рама MPx 1800x600x800мм с кабельным вводом сверху и панелями основания 1шт",null,"шт."]
["MF 180.80.100 D","Рама MPx 1800x800x1000мм с кабельным вводом сверху и панелями основания 1шт",null,"шт."]
["MF 180.80.40 D","Рама MPx 1800x800x400мм с кабельным вводом сверху и панелями основания 1шт",null,"шт."]
["MF 180.80.60 D","Рама MPx 1800x800x600мм с кабельным вводом сверху и панелями основания 1шт",null,"шт."]
["MF 180.80.80 D","Рама MPx 1800x800x800мм с кабельным вводом сверху и панелями основания 1шт",null,"шт."]
["MF 200.120.60 D","Рама MPx 2000x1200x600мм с кабельным вводом сверху и панелями основания 1шт",null,"шт."]
["MF 200.60.100 D","Рама MPx 2000x600x1000мм с кабельным вводом сверху и панелями основания 1шт",null,"шт."]
["MF 200.60.40 D","Рама MPx 2000x600x400мм с кабельным вводом сверху и панелями основания 1шт",null,"шт."]
["MF 200.60.60 D","Рама MPx 2000x600x600мм с кабельным вводом сверху и панелями основания 1шт",null,"шт."]
["MF 200.60.80 D","Рама MPx 2000x600x800мм с кабельным вводом сверху и панелями основания 1шт",null,"шт."]
["MF 200.80.100 D","Рама MPx 2000x800x1000мм с кабельным вводом сверху и панелями основания 1шт",null,"шт."]
["MF 200.80.120 D","Рама MPx 2000x800x1200мм с кабельным вводом сверху и панелями основания 1шт",null,"шт."]
["MF 200.80.40 D","Рама MPx 2000x800x400мм с кабельным вводом сверху и панелями основания 1шт",null,"шт."]
["MF 200.80.60 D","Рама MPx 2000x800x600мм с кабельным вводом сверху и панелями основания 1шт",null,"шт."]
["MF 200.80.80 D","Рама MPx 2000x800x800мм с кабельным вводом сверху и панелями основания 1шт",null,"шт."]
["MF 220.60.100 D","Рама MPx 2200x600x1000мм с кабельным вводом сверху и панелями основания 1шт",null,"шт."]
["MF 220.60.60 D","Рама MPx 2200x600x600мм с кабельным вводом сверху и панелями основания 1шт",null,"шт."]
["MF 220.60.80 D","Рама MPx 2200x600x800мм с кабельным вводом сверху и панелями основания 1шт",null,"шт."]
["MF 220.80.100 D","Рама MPx 2200x800x1000мм с кабельным вводом сверху и панелями основания 1шт",null,"шт."]
["MF 220.80.60 D","Рама MPx 2200x800x600мм с кабельным вводом сверху и панелями основания 1шт",null,"шт."]
["MF 220.80.80 D","Рама MPx 2200x800x800мм с кабельным вводом сверху и панелями основания 1шт",null,"шт."]
["MG 120 IT","Рейка 19\" 24U шкафа MPx высотой 1200мм 4шт",null,"уп."]
["MG 140 IT","Рейка 19\" 29U шкафа MPx высотой 1400мм 4шт",null,"уп."]
["MG 160 IT","Рейка 19\" 33U шкафа MPx высотой 1600мм 4шт",null,"уп."]
["MG 180 IT","Рейка 19\" 38U шкафа MPx высотой 1800мм 4шт",null,"уп."]
["MG 200 IT","Рейка 19\" 43U шкафа MPx высотой 2000мм 4шт",null,"уп."]
["MG 220 IT","Рейка 19\" 47U шкафа MPx высотой 2200мм 4шт",null,"уп."]
["VB 40 GE","Рейка двери шириной 400мм шкафа MEx 10шт",null,"уп."]
["VB 50 GE","Рейка двери шириной 500мм шкафа MEx 10шт",null,"уп."]
["VB 60 GE","Рейка двери шириной 600мм шкафа MEx 10шт",null,"уп."]
["VB 80 GE","Рейка двери шириной 800мм шкафа MEx 10шт",null,"уп."]
["VB 40 G","Рейка двери шириной 400мм шкафа MPx 10шт",null,"уп."]
["VB 50 G","Рейка двери шириной 500мм шкафа MPx 10шт",null,"уп."]
["VB 60 G","Рейка двери шириной 600мм шкафа MPx 10шт",null,"уп."]
["VB 80 G","Рейка двери шириной 800мм шкафа MPx 10шт",null,"уп."]
["VB 100","Вертикальная рейка двери шкафа MEx высотой 1000мм 2шт",null,"уп."]
["VB 120","Вертикальная рейка двери шкафа MEx высотой 1200мм 2шт",null,"уп."]
["VB 140","Вертикальная рейка двери шкафа MEx высотой 1400мм 2шт",null,"уп."]
["VB 160","Вертикальная рейка двери шкафа MEx высотой 1600мм 2шт",null,"уп."]
["VB 50","Вертикальная рейка двери шкафа MEx высотой 500мм 2шт",null,"уп."]
["VB 60","Вертикальная рейка двери шкафа MEx высотой 600мм 2шт",null,"уп."]
["VB 70","Вертикальная рейка двери шкафа MEx высотой 700мм 2шт",null,"уп."]
["VB 80","Вертикальная рейка двери шкафа MEx высотой 800мм 2шт",null,"уп."]
["MG 100","Кабельная гребёнка шкафа MPx шириной 1000мм 1шт",null,"шт."]
["MG 40","Кабельная гребёнка шкафа MPx шириной 400мм 1шт",null,"шт."]
["MG 60","Кабельная гребёнка шкафа MPx шириной 600мм 1шт",null,"шт."]
["MG 80","Кабельная гребёнка шкафа MPx шириной 800мм 1шт",null,"шт."]
["MG 60 EMC","Кабельная рейка ЭМС шкафа MPx шириной 600мм 1шт",null,"шт."]
["MG 80 EMC","Кабельная рейка ЭМС шкафа MPx шириной 800мм 1шт",null,"шт."]
["MG 30 E","Шина внутреннего монтажа MEx глубиной 210, 250, 300мм 4шт",null,"уп."]
["MG 50 E","Шина внутреннего монтажа MEx глубиной 400, 500мм 4шт",null,"уп."]
["MG 100.06","Монтажная рейка 49x14мм внутренний уровень MPx 1000мм 4шт",null,"уп."]
["MG 100.06 L v.2","Монтажная рейка 49x30мм внутренний и внешний уровень MPx 1000мм 4шт",null,"уп."]
["MG 100.09","Монтажная рейка 74x14мм внутренний уровень MPx 1000мм 4шт",null,"уп."]
["MG 100.09 L v.2","Монтажная рейка 74x30мм внутренний и внешний уровень MPx 1000мм 4шт",null,"уп."]
["MG 120.06","Монтажная рейка 49x14мм внутренний уровень MPx 1200мм 4шт",null,"уп."]
["MG 120.06 L v.2","Монтажная рейка 49x30мм внутренний и внешний уровень MPx 1200мм 4шт",null,"уп."]
["MG 120.09","Монтажная рейка 74x14мм внутренний уровень MPx 1200мм 4шт",null,"уп."]
["MG 120.09 L v.2","Монтажная рейка 74x30мм внутренний и внешний уровень MPx 1200мм 4шт",null,"уп."]
["MG 180.09 L v.2","Монтажная рейка 74x30мм внутренний и внешний уровень MPx 1800мм 4шт",null,"уп."]
["MG 200.09 L v.2","Монтажная рейка 74x30мм внутренний и внешний уровень MPx 2000мм 4шт",null,"уп."]
["MG 220.09 L v.2","Монтажная рейка 74x30мм внутренний и внешний уровень MPx 2200мм 4шт",null,"уп."]
["MG 40.06","Монтажная рейка 49x14мм внутренний уровень MPx 400мм 4шт",null,"уп."]
["MG 40.06 L v.2","Монтажная рейка 49x30мм внутренний и внешний уровень MPx 400мм 4шт",null,"уп."]
["MG 40.09","Монтажная рейка 74x14мм внутренний уровень MPx 400мм 4шт",null,"уп."]
["MG 40.09 L v.2","Монтажная рейка 74x30мм внутренний и внешний уровень MPx 400мм 4шт",null,"уп."]
["MG 50.06","Монтажная рейка 49x14мм внутренний уровень MPx 500мм 4шт",null,"уп."]
["MG 50.06 L v.2","Монтажная рейка 49x30мм внутренний и внешний уровень MPx 500мм 4шт",null,"уп."]
["MG 50.09","Монтажная рейка 74x14мм внутренний уровень MPx 500мм 4шт",null,"уп."]
["MG 50.09 L v.2","Монтажная рейка 74x30мм внутренний и внешний уровень MPx 500мм 4шт",null,"уп."]
["MG 60.06","Монтажная рейка 49x14мм внутренний уровень MPx 600мм 4шт",null,"уп."]
["MG 60.06 L v.2","Монтажная рейка 49x30мм внутренний и внешний уровень MPx 600мм 4шт",null,"уп."]
["MG 60.09","Монтажная рейка 74x14мм внутренний уровень MPx 600мм 4шт",null,"уп."]
["MG 60.09 L v.2","Монтажная рейка 74x30мм внутренний и внешний уровень MPx 600мм 4шт",null,"уп."]
["MG 80.06","Монтажная рейка 49x14мм внутренний уровень MPx 800мм 4шт",null,"уп."]
["MG 80.06 L v.2","Монтажная рейка 49x30мм внутренний и внешний уровень MPx 800мм 4шт",null,"уп."]
["MG 80.09","Монтажная рейка 74x14мм внутренний уровень MPx 800мм 4шт",null,"уп."]
["MG 80.09 L v.2","Монтажная рейка 74x30мм внутренний и внешний уровень MPx 800мм 4шт",null,"уп."]
["MG 40.03","Монтажная рейка 24x14мм внутренний уровень MPx 400мм 8шт",null,"уп."]
["MG 50.03","Монтажная рейка 24x14мм внутренний уровень MPx 500мм 8шт",null,"уп."]
["MG 60.03","Монтажная рейка 24x14мм внутренний уровень MPx 600мм 8шт",null,"уп."]
["MG 80.03","Монтажная рейка 24x14мм внутренний уровень MPx 800мм 8шт",null,"уп."]
["C 12.125","Ролик поворотный MPx транспортировочный без фиксатора 2шт",null,"уп."]
["C 12.125 T","Ролик поворотный MPx транспортировочный с фиксатором 2шт",null,"уп."]
["LH 1C.Z","Ручка поворотная двери MPx без ключа 1шт",null,"шт."]
["LE 12","Рым-болт шкафа MPx 4шт",null,"уп."]
["LA 5 LED M","Светильник LED 5 Вт, 290 лм, 351х34х32мм 100-240В с магнитным креплением 1шт",null,"шт."]
["LED 025","Светильник LED 5 Вт, 400 лм, 351х34х32мм 48-265В AC/DC с механическим креплением 1шт",null,"шт."]
["LED 025 PIR","Светильник LED 5 Вт, 400 лм, 351х34х32мм 48-265В AC/DC с механическим креплением, датчиком движения 1шт",null,"шт."]
["LA 5 LED S","Светильник светодиодный с датчиком движения, 230 В, 5 Вт, механическое крепление",null,"шт."]
["LA 5 LED","Светильник светодиодный, 230В, 5 Вт, механическое крепление",null,"шт."]
["LA 5.024 LED M","Светильник светодиодный, 24В, 5 Вт, крепление на магнитах",null,"шт."]
["MN 180.100","Монтажная сетка MPx 1800х1000мм 1шт",null,"шт."]
["MN 180.60","Монтажная сетка MPx 1800х600мм 1шт",null,"шт."]
["MN 180.80","Монтажная сетка MPx 1800х800мм 1шт",null,"шт."]
["MN 200.100","Монтажная сетка MPx 2000х1000мм 1шт",null,"шт."]
["MN 200.60","Монтажная сетка MPx 2000х600мм 1шт",null,"шт."]
["MN 200.80","Монтажная сетка MPx 2000х800мм 1шт",null,"шт."]
["MN 120.60 M","Монтажная сетка MPx секционная 1200х600мм 1шт",null,"шт."]
["MN 120.80 M","Монтажная сетка MPx секционная 1200х800мм 1шт",null,"шт."]
["MN 160.100 M","Монтажная сетка MPx секционная 1600х1000мм 1шт",null,"шт."]
["MN 160.60 M","Монтажная сетка MPx секционная 1600х600мм 1шт",null,"шт."]
["MN 160.80 M","Монтажная сетка MPx секционная 1600х800мм 1шт",null,"шт."]
["MN 180.100 M","Монтажная сетка MPx секционная 1800х1000мм 1шт",null,"шт."]
["MN 180.120 M","Монтажная сетка MPx секционная 1800х1200мм 1шт",null,"шт."]
["MN 180.40 M","Монтажная сетка MPx секционная 1800х400мм 1шт",null,"шт."]
["MN 180.60 M","Монтажная сетка MPx секционная 1800х600мм 1шт",null,"шт."]
["MN 180.80 M","Монтажная сетка MPx секционная 1800х800мм 1шт",null,"шт."]
["MN 90.100 M","Монтажная сетка MPx секционная 900х1000мм 1шт",null,"шт."]
["MN 90.80 M","Монтажная сетка MPx секционная 900х800мм 1шт",null,"шт."]
["WB 8","Скоба для настенного крепления MEx 4шт",null,"уп."]
["IK 01","Комплект для соединения шкафов MPx в линейку 1шт",null,"шт."]
["MG 100.04 CL","Монтажная траверса внешний уровень MPx 1000мм 4шт",null,"уп."]
["MG 40.04 CL","Монтажная траверса внешний уровень MPx 400мм 4шт",null,"уп."]
["MG 50.04 CL","Монтажная траверса внешний уровень MPx 500мм 4шт",null,"уп."]
["MG 60.04 CL","Монтажная траверса внешний уровень MPx 600мм 4шт",null,"уп."]
["MG 80.04 CL","Монтажная траверса внешний уровень MPx 800мм 4шт",null,"уп."]
["MG 100.04 C","Монтажная траверса внутренний уровень MPx 1000мм 4шт",null,"уп."]
["MG 120.04 C","Монтажная траверса внутренний уровень MPx 1200мм 4шт",null,"уп."]
["MG 40.04 C","Монтажная траверса внутренний уровень MPx 400мм 4шт",null,"уп."]
["MG 50.04 C","Монтажная траверса внутренний уровень MPx 500мм 4шт",null,"уп."]
["MG 60.04 C","Монтажная траверса внутренний уровень MPx 600мм 4шт",null,"уп."]
["MG 80.04 C","Монтажная траверса внутренний уровень MPx 800мм 4шт",null,"уп."]
["SH 60 F","Фиксатор подставки SH 60 D (для двери шириной 600 мм)",null,"шт."]
["EK 8 GP","Центральная точка заземления М8х20мм на каркас MPx 1шт",null,"шт."]
["BI 1.45 E","DK Шина заземления 15x5x450mm 1шт",null,"шт."]
["BI 1.45 N","DK Шина зануления 15x5x450mm 1шт",null,"шт."]
["MES 100.60.21","Шкаф MES 1000х600х210мм компактный 1шт","Корпус -1 шт.; Дверь - 1 шт.; Петля - 3 шт.; Замок с двойной бородкой - 2 шт.; Ключ - 1 шт.; Монтажная панель - 1 шт.; Панель кабельного ввода - 1 шт.; Упаковка","шт."]
["MES 100.60.25","Шкаф MES 1000х600х250мм компактный 1шт","Корпус -1 шт.; Дверь - 1 шт.; Петля - 3 шт.; Замок с двойной бородкой - 2 шт.; Ключ - 1 шт.; Монтажная панель - 1 шт.; Панель кабельного ввода - 1 шт.; Упаковка","шт."]
["MES 100.60.30","Шкаф MES 1000х600х300мм компактный 1шт","Корпус -1 шт.; Дверь - 1 шт.; Петля - 3 шт.; Замок с двойной бородкой - 2 шт.; Ключ - 1 шт.; Монтажная панель - 1 шт.; Панель кабельного ввода - 1 шт.; Упаковка","шт."]
["MES 100.60.40","Шкаф MES 1000х600х400мм компактный 1шт","Корпус -1 шт.; Панель концевая -  1 шт.; Дверь - 1 шт.; Петля - 3 шт.; Замок с двойной бородкой - 2 шт.; Ключ - 1 шт.; Монтажная панель - 1 шт.; Панель кабельного ввода сдвижная - 3 шт.; Упаковка","шт."]
["MES 100.80.25","Шкаф MES 1000х800х250мм компактный 1шт","Корпус -1 шт.; Дверь - 1 шт.; Петля - 3 шт.; Замок с двойной бородкой - 2 шт.; Ключ - 1 шт.; Монтажная панель - 1 шт.; Панель кабельного ввода - 1 шт.; Упаковка","шт."]
["MES 100.80.30","Шкаф MES 1000х800х300мм компактный 1шт","Корпус -1 шт.; Дверь - 1 шт.; Петля - 3 шт.; Замок с двойной бородкой - 2 шт.; Ключ - 1 шт.; Монтажная панель - 1 шт.; Панель кабельного ввода - 2 шт.; Упаковка","шт."]
["MES 100.80.40","Шкаф MES 1000х800х400мм компактный 1шт","Корпус -1 шт.; Панель концевая -  1 шт.; Дверь - 1 шт.; Петля - 3 шт.; Замок с двойной бородкой - 2 шт.; Ключ - 1 шт.; Монтажная панель - 1 шт.; Панель кабельного ввода сдвижная - 3 шт.; Упаковка","шт."]
["MES 120.60.21","Шкаф MES 1200х600х210мм компактный 1шт","Корпус -1шт Дверь - 1шт Монтажная панель - 1шт Панель кабельного ввода - 1шт Ключ - 1шт Упаковка - 1шт","шт."]
["MES 120.60.30","Шкаф MES 1200х600х300мм компактный 1шт","Корпус -1шт Дверь - 1шт Монтажная панель - 1шт Панель кабельного ввода - 1шт Ключ - 1шт Упаковка - 1шт","шт."]
["MES 120.60.40","Шкаф MES 1200х600х400мм компактный 1шт","Корпус -1шт Дверь - 1шт Рейка глухой двери - 2шт Монтажная панель - 1шт Сдвижные панели кабельного ввода - 3 шт Ключ - 1шт Упаковка - 1шт","шт."]
["MES 120.80.30","Шкаф MES 1200х800х300мм компактный 1шт","Корпус -1шт Дверь - 1шт Рейка глухой двери - 2шт Монтажная панель - 1шт Панель кабельного ввода - 2шт Ключ - 1шт Упаковка - 1шт","шт."]
["MES 120.80.40","Шкаф MES 1200х800х400мм компактный 1шт","Корпус -1шт Дверь - 1шт Рейка глухой двери - 2шт Монтажная панель - 1шт Сдвижные панели кабельного ввода - 3 шт Ключ - 1шт Упаковка - 1шт","шт."]
["MES 140.60.40","Шкаф MES 1400х600х400мм компактный 1шт","Корпус -1шт Дверь - 1шт Рейка глухой двери - 2шт Монтажная панель - 1шт Сдвижные панели кабельного ввода - 3 шт Ключ - 1шт Упаковка - 1шт","шт."]
["MES 140.80.30","Шкаф MES 1400х800х300мм компактный 1шт","Корпус -1шт Дверь - 1шт Рейка глухой двери - 2шт Монтажная панель - 1шт Панель кабельного ввода - 2шт Ключ - 1шт Упаковка - 1шт","шт."]
["MES 140.80.40","Шкаф MES 1400х800х400мм компактный 1шт","Корпус -1шт Дверь - 1шт Рейка глухой двери - 2шт Монтажная панель - 1шт Сдвижные панели кабельного ввода - 3 шт Ключ - 1шт Упаковка - 1шт","шт."]
["MES 160.40.30","Шкаф MES 1600х400х300мм компактный 1шт","Корпус -1шт Дверь - 1шт Рейка глухой двери - 2шт Монтажная панель - 1шт Ключ - 1шт Упаковка - 1шт","шт."]
["MES 160.60.40","Шкаф MES 1600х600х400мм компактный 1шт","Корпус -1шт Дверь - 1шт Рейка глухой двери - 2шт Монтажная панель - 1шт Сдвижные панели кабельного ввода - 3 шт Ключ - 1шт Упаковка - 1шт","шт."]
["MES 20.20.08","Шкаф MES 200х200х80мм компактный 1шт","Корпус - 1шт Дверь - 1шт Монтажная панель - 1шт Ключ - 1шт Упаковка - 1шт","шт."]
["MES 20.20.12","Шкаф MES 200х200х120мм компактный 1шт","Корпус - 1шт Дверь - 1шт Монтажная панель - 1шт Ключ - 1шт Упаковка - 1шт","шт."]
["MES 200.40.30","Шкаф MES 2000х400х300мм компактный 1шт","Корпус - 1шт Дверь - 1шт Монтажная панель - 1шт Ключ - 1шт Упаковка - 1шт","шт."]
["MES 30.20.08","Шкаф MES 300х200х80мм компактный 1шт","Корпус - 1шт Дверь - 1шт Монтажная панель - 1шт Ключ - 1шт Упаковка - 1шт","шт."]
["MES 30.20.12","Шкаф MES 300х200х120мм компактный 1шт","Корпус - 1шт Дверь - 1шт Монтажная панель - 1шт Ключ - 1шт Упаковка - 1шт","шт."]
["MES 30.20.15","Шкаф MES 300х200х150мм компактный 1шт","Корпус - 1шт Дверь - 1шт Панель кабельного ввода - 1шт Монтажная панель - 1шт Ключ - 1шт Упаковка - 1шт","шт."]
["MES 30.30.12","Шкаф MES 300х300х120мм компактный 1шт","Корпус - 1шт Дверь - 1шт Монтажная панель - 1шт Ключ - 1шт Упаковка - 1шт","шт."]
["MES 30.30.15","Шкаф MES 300х300х150мм компактный 1шт","Корпус -1шт Дверь - 1шт Монтажная панель - 1шт Панель кабельного ввода - 1шт Ключ - 1шт Упаковка - 1шт","шт."]
["MES 30.40.15","Шкаф MES 300х400х150мм компактный 1шт","Корпус -1шт Дверь - 1шт Монтажная панель - 1шт Панель кабельного ввода - 1шт Ключ - 1шт Упаковка - 1шт","шт."]
["MES 40.30.12","Шкаф MES 400х300х120мм компактный 1шт","Корпус - 1шт Дверь - 1шт Монтажная панель - 1шт Ключ - 1шт Упаковка - 1шт","шт."]
["MES 40.30.15","Шкаф MES 400х300х150мм компактный 1шт","Корпус -1шт Дверь - 1шт Монтажная панель - 1шт Панель кабельного ввода - 1шт Ключ - 1шт Упаковка - 1шт","шт."]
["MES 40.30.21","Шкаф MES 400х300х210мм компактный 1шт","Корпус -1шт Дверь - 1шт Монтажная панель - 1шт Панель кабельного ввода - 1шт Ключ - 1шт Упаковка - 1шт","шт."]
["MES 40.40.21","Шкаф MES 400х400х210мм компактный 1шт","Корпус -1шт Дверь - 1шт Монтажная панель - 1шт Панель кабельного ввода - 1шт Ключ - 1шт Упаковка - 1шт","шт."]
["MES 40.40.25","Шкаф MES 400х400х250мм компактный 1шт","Корпус -1шт Дверь - 1шт Монтажная панель - 1шт Панель кабельного ввода - 1шт Ключ - 1шт Упаковка - 1шт","шт."]
["MES 40.60.21","Шкаф MES 400х600х210мм компактный 1шт","Корпус -1шт Дверь - 1шт Монтажная панель - 1шт Панель кабельного ввода - 1шт Ключ - 1шт Упаковка - 1шт","шт."]
["MES 50.30.21","Шкаф MES 500х300х210мм компактный 1шт","Корпус -1шт Дверь - 1шт Монтажная панель - 1шт Панель кабельного ввода - 1шт Ключ - 1шт Упаковка - 1шт","шт."]
["MES 50.40.21","Шкаф MES 500х400х210мм компактный 1шт","Корпус -1шт Дверь - 1шт Монтажная панель - 1шт Панель кабельного ввода - 1шт Ключ - 1шт Упаковка - 1шт","шт."]
["MES 50.40.25","Шкаф MES 500х400х250мм компактный 1шт","Корпус -1шт Дверь - 1шт Монтажная панель - 1шт Панель кабельного ввода - 1шт Ключ - 1шт Упаковка - 1шт","шт."]
["MES 50.50.21","Шкаф MES 500х500х210мм компактный 1шт","Корпус -1шт Дверь - 1шт Монтажная панель - 1шт Панель кабельного ввода - 1шт Ключ - 1шт Упаковка - 1шт","шт."]
["MES 50.50.30","Шкаф MES 500х500х300мм компактный 1шт","Корпус -1шт Дверь - 1шт Монтажная панель - 1шт Панель кабельного ввода - 1шт Ключ - 1шт Упаковка - 1шт","шт."]
["MES 60.40.21","Шкаф MES 600х400х210мм компактный 1шт","Корпус -1шт Дверь - 1шт Монтажная панель - 1шт Панель кабельного ввода - 1шт Ключ - 1шт Упаковка - 1шт","шт."]
["MES 60.40.25","Шкаф MES 600х400х250мм компактный 1шт","Корпус -1шт Дверь - 1шт Монтажная панель - 1шт Панель кабельного ввода - 1шт Ключ - 1шт Упаковка - 1шт","шт."]
["MES 60.40.30","Шкаф MES 600х400х300мм компактный 1шт","Корпус -1шт Дверь - 1шт Монтажная панель - 1шт Панель кабельного ввода - 1шт Ключ - 1шт Упаковка - 1шт","шт."]
["MES 60.50.21","Шкаф MES 600х500х210мм компактный 1шт","Корпус -1шт Дверь - 1шт Монтажная панель - 1шт Панель кабельного ввода - 1шт Ключ - 1шт Упаковка - 1шт","шт."]
["MES 60.60.21","Шкаф MES 600х600х210мм компактный 1шт","Корпус -1шт Дверь - 1шт Монтажная панель - 1шт Панель кабельного ввода - 1шт Ключ - 1шт Упаковка - 1шт","шт."]
["MES 60.60.25","Шкаф MES 600х600х250мм компактный 1шт","Корпус -1шт Дверь - 1шт Монтажная панель - 1шт Панель кабельного ввода - 1шт Ключ - 1шт Упаковка - 1шт","шт."]
["MES 60.60.30","Шкаф MES 600х600х300мм компактный 1шт","Корпус -1шт Дверь - 1шт Монтажная панель - 1шт Панель кабельного ввода - 1шт Ключ - 1шт Упаковка - 1шт","шт."]
["MES 70.50.21","Шкаф MES 600х600х210мм компактный 1шт","Корпус -1шт Дверь - 1шт Монтажная панель - 1шт Панель кабельного ввода - 1шт Ключ - 1шт Упаковка - 1шт","шт."]
["MES 70.50.25","Шкаф MES 700х500х250мм компактный 1шт","Корпус -1шт Дверь - 1шт Монтажная панель - 1шт Панель кабельного ввода - 1шт Ключ - 1шт Упаковка - 1шт","шт."]
["MES 70.50.30","Шкаф MES 700х500х300мм компактный 1шт","Корпус -1шт Дверь - 1шт Монтажная панель - 1шт Панель кабельного ввода - 1шт Ключ - 1шт Упаковка - 1шт","шт."]
["MES 80.60.21","Шкаф MES 800х600х210мм компактный 1шт","Корпус -1шт Дверь - 1шт Монтажная панель - 1шт Панель кабельного ввода - 1шт Ключ - 1шт Упаковка - 1шт","шт."]
["MES 80.60.25","Шкаф MES 800х600х250мм компактный 1шт","Корпус -1шт Дверь - 1шт Монтажная панель - 1шт Панель кабельного ввода - 1шт Ключ - 1шт Упаковка - 1шт","шт."]
["MES 80.60.30","Шкаф MES 800х600х300мм компактный 1шт","Корпус -1шт Дверь - 1шт Монтажная панель - 1шт Панель кабельного ввода - 1шт Ключ - 1шт Упаковка - 1шт","шт."]
["MES 80.60.40","Шкаф MES 800х600х400мм компактный 1шт","Корпус -1шт Дверь - 1шт Монтажная панель - 1шт Сдвижные панели кабельного ввода - 3 шт Ключ - 1шт Упаковка - 1шт","шт."]
["MES 80.80.30","Шкаф MES 800х800х300мм компактный 1шт","Корпус -1шт Дверь - 1шт Монтажная панель - 1шт Панель кабельного ввода - 2шт Ключ - 1шт Упаковка - 1шт","шт."]
["MED 100.100.30","Шкаф MED 1000х1000х300мм 2-дверный компактный 1шт","Корпус -1шт Дверь - 2шт Монтажная панель - 1шт Панель кабельного ввода - 2шт Ключ - 1шт Упаковка - 1шт","шт."]
["MED 120.100.40","Шкаф MED 1200х1000х400мм 2-дверный компактный 1шт","Корпус -1шт Дверь - 2шт Рейка глухой двери - 4шт Монтажная панель - 1шт Сдвижные панели кабельного ввода - 6 шт Ключ - 1шт Упаковка - 1шт","шт."]
["MED 120.120.30","Шкаф MED 1200х1200х300мм 2-дверный компактный 1шт","Корпус -1шт Дверь - 2шт Монтажная панель - 1шт Панель кабельного ввода - 2шт Ключ - 1шт Упаковка - 1шт","шт."]
["MED 140.100.40","Шкаф MED 1400х1000х400мм 2-дверный компактный 1шт","Корпус -1шт Дверь - 2шт Рейка глухой двери - 4шт Монтажная панель - 1шт Сдвижные панели кабельного ввода - 6 шт Ключ - 1шт Упаковка - 1шт","шт."]
["MED 140.80.40","Шкаф MED 1400х800х400мм 2-дверный компактный 1шт","Корпус -1шт Дверь - 2шт Рейка глухой двери - 4шт Монтажная панель - 1шт Сдвижные панели кабельного ввода - 6 шт Ключ - 1шт Упаковка - 1шт\"","шт."]
["MED 80.100.25","Шкаф MED 800х1000х250мм 2-дверный компактный 1шт","Корпус -1шт Дверь - 2шт Монтажная панель - 1шт Панель кабельного ввода - 2шт Ключ - 1шт Упаковка - 1шт","шт."]
["MED 80.100.30","Шкаф MED 800х1000х300мм 2-дверный компактный 1шт","Корпус -1шт Дверь - 2шт Монтажная панель - 1шт Панель кабельного ввода - 2шт Ключ - 1шт Упаковка - 1шт","шт."]
["MED 80.120.30","Шкаф MED 800х1200х300мм 2-дверный компактный 1шт","Корпус -1шт Дверь - 2шт Монтажная панель - 1шт Панель кабельного ввода - 2шт Ключ - 1шт Упаковка - 1шт","шт."]
["MPS 120.60.60","Шкаф MPS 1200х600х600мм напольный 1шт","Рама - 1 шт.; Панель потолочная - 1 шт.; Панели кабельного ввода - 1 компл.; Дверь - 1 шт.; Панель задняя - 1 шт.; Панель монтажная - 1 шт.; Монтажная траверса MG 60.04 CL - 2 шт.; Ключ - 1 шт.; Упаковка.","шт."]
["MPS 120.80.40","Шкаф MPS 1200х800х400мм напольный 1шт","Рама - 1 шт.; Панель потолочная - 1 шт.; Панели кабельного ввода - 1 компл.; Дверь - 1 шт.; Панель задняя - 1 шт.; Панель монтажная - 1 шт.; Монтажная траверса MG 80.04 CL - 2 шт.; Ключ - 1 шт.; Упаковка.","шт."]
["MPS 120.80.60","Шкаф MPS 1200х800х600мм напольный 1шт","Рама - 1 шт.; Панель потолочная - 1 шт.; Панели кабельного ввода - 1 компл.; Дверь - 1 шт.; Панель задняя - 1 шт.; Панель монтажная - 1 шт.; Монтажная траверса MG 60.04 CL - 2 шт.; Ключ - 1 шт.; Упаковка.","шт."]
["MPS 140.60.60","Шкаф MPS 1400х600х600мм напольный 1шт","Рама - 1 шт.; Панель потолочная - 1 шт.; Панели кабельного ввода - 1 компл.; Дверь - 1 шт.; Панель задняя - 1 шт.; Панель монтажная - 1 шт.; Монтажная траверса MG 60.04 CL - 2 шт.; Ключ - 1 шт.; Упаковка.","шт."]
["MPS 160.60.40","Шкаф MPS 1600х600х400мм напольный 1шт","Рама - 1 шт.; Панель потолочная - 1 шт.; Панели кабельного ввода - 1 компл.; Дверь - 1 шт.; Панель задняя - 1 шт.; Панель монтажная - 1 шт.; Монтажная траверса MG 40.04 CL - 2 шт.; Ключ - 1 шт.; Упаковка.","шт."]
["MPS 160.60.50","Шкаф MPS 1600х600х500мм напольный 1шт","Рама - 1 шт.; Панель потолочная - 1 шт.; Панели кабельного ввода - 1 компл.; Дверь - 1 шт.; Панель задняя - 1 шт.; Панель монтажная - 1 шт.; Монтажная траверса MG 80.04 CL - 2 шт.; Ключ - 1 шт.; Упаковка.","шт."]
["MPS 160.60.60","Шкаф MPS 1600х600х600мм напольный 1шт","Рама - 1 шт.; Панель потолочная - 1 шт.; Панели кабельного ввода - 1 компл.; Дверь - 1 шт.; Панель задняя - 1 шт.; Панель монтажная - 1 шт.; Монтажная траверса MG 60.04 CL - 2 шт.; Ключ - 1 шт.; Упаковка.","шт."]
["MPS 160.60.80","Шкаф MPS 1600х600х800мм напольный 1шт","Рама - 1 шт.; Панель потолочная - 1 шт.; Панели кабельного ввода - 1 компл.; Дверь - 1 шт.; Панель задняя - 1 шт.; Панель монтажная - 1 шт.; Монтажная траверса MG 80.04 CL - 2 шт.; Ключ - 1 шт.; Упаковка.","шт."]
["MPS 160.80.40","Шкаф MPS 1600х800х400мм напольный 1шт","Рама - 1 шт.; Панель потолочная - 1 шт.; Панели кабельного ввода - 1 компл.; Дверь - 1 шт.; Панель задняя - 1 шт.; Панель монтажная - 1 шт.; Монтажная траверса MG 40.04 CL - 2 шт.; Ключ - 1 шт.; Упаковка.","шт."]
["MPS 160.80.50","Шкаф MPS 1600х800х500мм напольный 1шт","Рама - 1 шт.; Панель потолочная - 1 шт.; Панели кабельного ввода - 1 компл.; Дверь - 1 шт.; Панель задняя - 1 шт.; Панель монтажная - 1 шт.; Монтажная траверса MG 80.04 CL - 2 шт.; Ключ - 1 шт.; Упаковка.","шт."]
["MPS 160.80.60","Шкаф MPS 1600х800х600мм напольный 1шт","Рама - 1 шт.; Панель потолочная - 1 шт.; Панели кабельного ввода - 1 компл.; Дверь - 1 шт.; Панель задняя - 1 шт.; Панель монтажная - 1 шт.; Монтажная траверса MG 60.04 CL - 2 шт.; Ключ - 1 шт.; Упаковка.","шт."]
["MPS 180.40.50","Шкаф MPS 1800х400х500мм напольный 1шт","Рама - 1 шт.; Панель потолочная - 1 шт.; Панели кабельного ввода - 1 компл.; Дверь - 1 шт.; Панель задняя - 1 шт.; Монтажная траверса MG 50.04 CL - 2 шт.; Ключ - 1 шт.; Упаковка.","шт."]
["MPS 180.40.60","Шкаф MPS 1800х400х600мм напольный 1шт","Рама - 1 шт.; Панель потолочная - 1 шт.; Панели кабельного ввода - 1 компл.; Дверь - 1 шт.; Панель задняя - 1 шт.; Монтажная траверса MG 60.04 CL - 2 шт.; Ключ - 1 шт.; Упаковка.","шт."]
["MPS 180.60.40","Шкаф MPS 1800х600х400мм напольный 1шт","Рама - 1 шт.; Панель потолочная - 1 шт.; Панели кабельного ввода - 1 компл.; Дверь - 1 шт.; Панель задняя - 1 шт.; Панель монтажная - 1 шт.; Монтажная траверса MG 40.04 CL - 2 шт.; Ключ - 1 шт.; Упаковка.","шт."]
["MPS 180.60.50","Шкаф MPS 1800х600х500мм напольный 1шт","Рама - 1 шт.; Панель потолочная - 1 шт.; Панели кабельного ввода - 1 компл.; Дверь - 1 шт.; Панель задняя - 1 шт.; Панель монтажная - 1 шт.; Монтажная траверса MG 50.04 CL - 2 шт.; Ключ - 1 шт.; Упаковка.","шт."]
["MPS 180.60.60","Шкаф MPS 1800х600х600мм напольный 1шт","Рама - 1 шт.; Панель потолочная - 1 шт.; Панели кабельного ввода - 1 компл.; Дверь - 1 шт.; Панель задняя - 1 шт.; Панель монтажная - 1 шт.; Монтажная траверса MG 60.04 CL - 2 шт.; Ключ - 1 шт.; Упаковка.","шт."]
["MPS 180.80.40","Шкаф MPS 1800х800х400мм напольный 1шт","Рама - 1 шт.; Панель потолочная - 1 шт.; Панели кабельного ввода - 1 компл.; Дверь - 1 шт.; Панель задняя - 1 шт.; Панель монтажная - 1 шт.; Монтажная траверса MG 40.04 CL - 2 шт.; Ключ - 1 шт.; Упаковка.","шт."]
["MPS 180.80.50","Шкаф MPS 1800х800х500мм напольный 1шт","Рама - 1 шт.; Панель потолочная - 1 шт.; Панели кабельного ввода - 1 компл.; Дверь - 1 шт.; Панель задняя - 1 шт.; Панель монтажная - 1 шт.; Монтажная траверса MG 50.04 CL - 2 шт.; Ключ - 1 шт.; Упаковка.","шт."]
["MPS 180.80.60","Шкаф MPS 1800х800х600мм напольный 1шт","Рама - 1 шт.; Панель потолочная - 1 шт.; Панели кабельного ввода - 1 компл.; Дверь - 1 шт.; Панель задняя - 1 шт.; Панель монтажная - 1 шт.; Монтажная траверса  - 2 шт.; Ключ - 1 шт.; Упаковка.","шт."]
["MPS 200.40.50","Шкаф MPS 2000х400х500мм напольный 1шт","Рама - 1 шт.; Панель потолочная - 1 шт.; Панели кабельного ввода - 1 компл.; Дверь - 1 шт.; Панель задняя - 1 шт.; Монтажная траверса MG 50.04 CL - 2 шт.; Ключ - 1 шт.; Упаковка.","шт."]
["MPS 200.40.60","Шкаф MPS 2000х400х600мм напольный 1шт","Рама - 1 шт.; Панель потолочная - 1 шт.; Панели кабельного ввода - 1 компл.; Дверь - 1 шт.; Панель задняя - 1 шт.; Монтажная траверса MG 60.04 CL - 2 шт.; Ключ - 1 шт.; Упаковка.","шт."]
["MPS 200.60.40","Шкаф MPS 2000х600х400мм напольный 1шт","Рама - 1 шт.; Панель потолочная - 1 шт.; Панели кабельного ввода - 1 компл.; Дверь - 1 шт.; Панель задняя - 1 шт.; Панель монтажная - 1 шт.; Монтажная траверса MG 40.04 CL - 2 шт.; Ключ - 1 шт.; Упаковка.","шт."]
["MPS 200.60.50","Шкаф MPS 2000х600х500мм напольный 1шт","Рама - 1 шт.; Панель потолочная - 1 шт.; Панели кабельного ввода - 1 компл.; Дверь - 1 шт.; Панель задняя - 1 шт.; Панель монтажная - 1 шт.; Монтажная траверса MG 50.04 CL - 2 шт.; Ключ - 1 шт.; Упаковка.","шт."]
["MPS 200.60.60","Шкаф MPS 2000х600х600мм напольный 1шт","Рама - 1 шт.; Панель потолочная - 1 шт.; Панели кабельного ввода - 1 компл.; Дверь - 1 шт.; Панель задняя - 1 шт.; Панель монтажная - 1 шт.; Монтажная траверса MG 60.04 CL - 2 шт.; Ключ - 1 шт.; Упаковка.","шт."]
["MPS 200.60.80","Шкаф MPS 2000х600х800мм напольный 1шт","Рама - 1 шт.; Панель потолочная - 1 шт.; Панели кабельного ввода - 1 компл.; Дверь - 1 шт.; Панель задняя - 1 шт.; Панель монтажная - 1 шт.; Монтажная траверса MG 80.04 CL - 2 шт.; Ключ - 1 шт.; Упаковка.","шт."]
["MPS 200.80.40","Шкаф MPS 2000х800х400мм напольный 1шт","Рама - 1 шт.; Панель потолочная - 1 шт.; Панели кабельного ввода - 1 компл.; Дверь - 1 шт.; Панель задняя - 1 шт.; Панель монтажная - 1 шт.; Монтажная траверса MG 40.04 CL - 2 шт.; Ключ - 1 шт.; Упаковка.","шт."]
["MPS 200.80.50","Шкаф MPS 2000х800х500мм напольный 1шт","Рама - 1 шт.; Панель потолочная - 1 шт.; Панели кабельного ввода - 1 компл.; Дверь - 1 шт.; Панель задняя - 1 шт.; Панель монтажная - 1 шт.; Монтажная траверса MG 50.04 CL - 2 шт.; Ключ - 1 шт.; Упаковка.","шт."]
["MPS 200.80.60","Шкаф MPS 2000х800х600мм напольный 1шт","Рама - 1 шт.; Панель потолочная - 1 шт.; Панели кабельного ввода - 1 компл.; Дверь - 1 шт.; Панель задняя - 1 шт.; Панель монтажная - 1 шт.; Монтажная траверса MG 60.04 CL - 2 шт.; Ключ - 1 шт.; Упаковка.","шт."]
["MPS 200.80.80","Шкаф MPS 2000х800х800мм напольный 1шт","Рама - 1 шт.; Панель потолочная - 1 шт.; Панели кабельного ввода - 1 компл.; Дверь - 1 шт.; Панель задняя - 1 шт.; Панель монтажная - 1 шт.; Монтажная траверса MG 80.04 CL - 2 шт.; Ключ - 1 шт.; Упаковка.","шт."]
["MPS 220.60.60","Шкаф MPS 2200х600х600мм напольный 1шт","Рама - 1 шт.; Панель потолочная - 1 шт.; Панели кабельного ввода - 1 компл.; Дверь - 1 шт.; Панель задняя - 1 шт.; Панель монтажная - 1 шт.; Монтажная траверса MG 60.04 CL - 2 шт.; Ключ - 1 шт.; Упаковка.","шт."]
["MPS 220.60.80","Шкаф MPS 2200х600х800мм напольный 1шт","Рама - 1 шт.; Панель потолочная - 1 шт.; Панели кабельного ввода - 1 компл.; Дверь - 1 шт.; Панель задняя - 1 шт.; Панель монтажная - 1 шт.; Монтажная траверса MG 80.04 CL - 2 шт.; Ключ - 1 шт.; Упаковка.","шт."]
["MPS 220.80.40","Шкаф MPS 2200х800х400мм напольный 1шт","Рама - 1 шт.; Панель потолочная - 1 шт.; Панели кабельного ввода - 1 компл.; Дверь - 1 шт.; Панель задняя - 1 шт.; Панель монтажная - 1 шт.; Монтажная траверса MG 40.04 CL - 2 шт.; Ключ - 1 шт.; Упаковка.","шт."]
["MPS 220.80.60","Шкаф MPS 2200х800х600мм напольный 1шт","Рама - 1 шт.; Панель потолочная - 1 шт.; Панели кабельного ввода - 1 компл.; Дверь - 1 шт.; Панель задняя - 1 шт.; Панель монтажная - 1 шт.; Монтажная траверса MG 60.04 CL - 2 шт.; Ключ - 1 шт.; Упаковка.","шт."]
["MPS 220.80.80","Шкаф MPS 2200х800х800мм напольный 1шт","Рама - 1 шт.; Панель потолочная - 1 шт.; Панели кабельного ввода - 1 компл.; Дверь - 1 шт.; Панель задняя - 1 шт.; Панель монтажная - 1 шт.; Монтажная траверса MG 80.04 CL - 2 шт.; Ключ - 1 шт.; Упаковка.","шт."]
["MPD 120.80.50","Шкаф MPD 1200х800х500мм 2-дверный напольный 1шт","Рама - 1 шт.; Панель потолочная - 1 шт.; Панели кабельного ввода - 1 компл.; Дверь - 2 шт.; Панель задняя - 1 шт.; Панель монтажная - 1 шт.; Монтажная траверса MG 40.04 CL - 2 шт.; Ключ - 1 шт.; Упаковка.","шт."]
["MPD 180.100.40","Шкаф MPD 1800х1000х400мм 2-дверный напольный 1шт","Рама - 1 шт.; Панель потолочная - 1 шт.; Панели кабельного ввода - 1 компл.; Дверь - 2 шт.; Панель задняя - 1 шт.; Панель монтажная - 1 шт.; Монтажная траверса MG 40.04 CL - 2 шт.; Ключ - 1 шт.; Упаковка.","шт."]
["MPD 180.120.40","Шкаф MPD 1800х1200х400мм 2-дверный напольный 1шт","Рама - 1 шт.; Панель потолочная - 1 шт.; Панели кабельного ввода - 1 компл.; Дверь - 2 шт.; Панель задняя - 1 шт.; Панель монтажная - 1 шт.; Монтажная траверса MG 40.04 CL - 2 шт.; Ключ - 1 шт.; Упаковка.","шт."]
["MPD 180.120.50","Шкаф MPD 1800х1200х500мм 2-дверный напольный 1шт","Рама - 1 шт.; Панель потолочная - 1 шт.; Панели кабельного ввода - 1 компл.; Дверь - 2 шт.; Панель задняя - 1 шт.; Панель монтажная - 1 шт.; Монтажная траверса MG 50.04 CL - 2 шт.; Ключ - 1 шт.; Упаковка.","шт."]
["MPD 180.120.60","Шкаф MPD 1800х1200х600мм 2-дверный напольный 1шт","Рама - 1 шт.; Панель потолочная - 1 шт.; Панели кабельного ввода - 1 компл.; Дверь - 2 шт.; Панель задняя - 1 шт.; Панель монтажная - 1 шт.; Монтажная траверса MG 60.04 CL - 2 шт.; Ключ - 1 шт.; Упаковка.","шт."]
["MPD 200.100.40","Шкаф MPD 2000х1000х400мм 2-дверный напольный 1шт","Рама - 1 шт.; Панель потолочная - 1 шт.; Панели кабельного ввода - 1 компл.; Дверь - 2 шт.; Панель задняя - 1 шт.; Панель монтажная - 1 шт.; Монтажная траверса MG 40.04 CL - 2 шт.; Ключ - 1 шт.; Упаковка.","шт."]
["MPD 200.100.50","Шкаф MPD 2000х1000х500мм 2-дверный напольный 1шт","Рама - 1 шт.; Панель потолочная - 1 шт.; Панели кабельного ввода - 1 компл.; Дверь - 2 шт.; Панель задняя - 1 шт.; Панель монтажная - 1 шт.; Монтажная траверса MG 50.04 CL - 2 шт.; Ключ - 1 шт.; Упаковка.","шт."]
["MPD 200.100.60","Шкаф MPD 2000х1000х600мм 2-дверный напольный 1шт","Рама - 1 шт.; Панель потолочная - 1 шт.; Панели кабельного ввода - 1 компл.; Дверь - 2 шт.; Панель задняя - 1 шт.; Панель монтажная - 1 шт.; Монтажная траверса MG 60.04 CL - 2 шт.; Ключ - 1 шт.; Упаковка.","шт."]
["MPD 200.100.80","Шкаф MPD 2000х1000х800мм 2-дверный напольный 1шт","Рама - 1 шт.; Панель потолочная - 1 шт.; Панели кабельного ввода - 1 компл.; Дверь - 2 шт.; Панель задняя - 1 шт.; Панель монтажная - 1 шт.; Монтажная траверса MG 60.04 CL - 2 шт.; Ключ - 1 шт.; Упаковка.","шт."]
["MPD 200.120.40","Шкаф MPD 2000х1200х400мм 2-дверный напольный 1шт","Рама - 1 шт.; Панель потолочная - 1 шт.; Панели кабельного ввода - 1 компл.; Дверь - 2 шт.; Панель задняя - 1 шт.; Панель монтажная - 1 шт.; Монтажная траверса MG 50.04 CL - 2 шт.; Ключ - 1 шт.; Упаковка.","шт."]
["MPD 200.120.50","Шкаф MPD 2000х1200х500мм 2-дверный напольный 1шт","Рама - 1 шт.; Панель потолочная - 1 шт.; Панели кабельного ввода - 1 компл.; Дверь - 2 шт.; Панель задняя - 1 шт.; Панель монтажная - 1 шт.; Монтажная траверса MG 50.04 CL - 2 шт.; Ключ - 1 шт.; Упаковка.","шт."]
["MPD 200.120.60","Шкаф MPD 2000х1200х600мм 2-дверный напольный 1шт","Рама - 1 шт.; Панель потолочная - 1 шт.; Панели кабельного ввода - 1 компл.; Дверь - 2 шт.; Панель задняя - 1 шт.; Панель монтажная - 1 шт.; Монтажная траверса MG 60.04 CL - 2 шт.; Ключ - 1 шт.; Упаковка.","шт."]
["MPD 200.120.80","Шкаф MPD 2000х1200х800мм 2-дверный напольный 1шт","Рама - 1 шт.; Панель потолочная - 1 шт.; Панели кабельного ввода - 1 компл.; Дверь - 2 шт.; Панель задняя - 1 шт.; Панель монтажная - 1 шт.; Монтажная траверса MG 80.04 CL - 2 шт.; Ключ - 1 шт.; Упаковка.","шт."]
["MPD 220.100.60","Шкаф MPD 2200х1000х600мм 2-дверный напольный 1шт","Рама - 1 шт.; Панель потолочная - 1 шт.; Панели кабельного ввода - 1 компл.; Дверь - 2 шт.; Панель задняя - 1 шт.; Панель монтажная - 1 шт.; Монтажная траверса MG 60.04 CL - 2 шт.; Ключ - 1 шт.; Упаковка.","шт."]
["MPD 220.100.80","Шкаф MPD 2200х1000х800мм 2-дверный напольный 1шт","Рама - 1 шт.; Панель потолочная - 1 шт.; Панели кабельного ввода - 1 компл.; Дверь - 2 шт.; Панель задняя - 1 шт.; Панель монтажная - 1 шт.; Монтажная траверса MG 60.04 CL - 2 шт.; Ключ - 1 шт.; Упаковка.","шт."]
["MPD 220.120.60","Шкаф MPD 2200х1200х600мм 2-дверный напольный 1шт","Рама - 1 шт.; Панель потолочная - 1 шт.; Панели кабельного ввода - 1 компл.; Дверь - 2 шт.; Панель задняя - 1 шт.; Панель монтажная - 1 шт.; Монтажная траверса MG 60.04 CL - 2 шт.; Ключ - 1 шт.; Упаковка.","шт."]
["S 5.11","Винт самонарезающий М5х11, 100шт. в комп.",null,"уп."]
["IK 01 ZA v.2","Соединительный комплект цоколей, 1шт",null,"шт."]
["0-"]
["MB 05.48 LA","Кронштейн для крепления светильника на плоскость 19\"",null,"шт."]
["пусто"]

{"sheet":"Прайс","index":3,"n_rows":2114,"n_cols":4,"rows_kept":2114,"cut":false,"hidden":false,"merged":[]}
["Код продукции","Расшифровка","Ед.изм","Прайс цена, руб с НДС"]
["DR 07.135","DIN - рейка для коробок распределительных, 10шт.","комп",675]
["DR 07.185","DIN - рейка для коробок распределительных, 10шт.","комп",925]
["DR 07.285","DIN - рейка для коробок распределительных, 10шт.","комп",1425]
["DR 07.385","DIN - рейка для коробок распределительных, 10шт.","комп",1925]
["DR 15.425","DIN - рейка для модульной рамы, 10шт.","комп",3052]
["DR 15.625","DIN - рейка для модульной рамы, 10шт.","комп",6451]
["DR 07.125","DIN - рейка, 10шт.","комп",1725]
["DR 07.2000","DIN - рейка, 10шт.","комп",12793]
["DR 07.225","DIN - рейка, 10шт.","комп",1318]
["DR 07.325","DIN - рейка, 10шт.","комп",1679]
["DR 07.525","DIN - рейка, 10шт.","комп",2677]
["DR 07.725","DIN - рейка, 10шт.","комп",3724]
["DR 15.125","DIN - рейка, 10шт.","комп",1461]
["DR 15.2000","DIN - рейка, 10шт.","комп",22491]
["DR 15.225","DIN - рейка, 10шт.","комп",2386]
["DR 15.325","DIN - рейка, 10шт.","комп",2789]
["DR 15.525","DIN - рейка, 10шт.","комп",4213]
["DR 15.725","DIN - рейка, 10шт.","комп",7311]
["MF 40 D","Балка для рамы MF","шт",1010]
["MF 50 D","Балка для рамы MF","шт",1270]
["MF 60 D","Балка для рамы MF","шт",1450]
["MF 80 D","Балка для рамы MF","шт",2137]
["ZA 00.30 S v.2","Боковые элементы цоколя из нержавеющей стали. 2 шт.","комп",5059]
["ZA 00.40 S v.2","Боковые элементы цоколя из нержавеющей стали. 2 шт.","комп",9158]
["ZA 00.50 HS v.2","Боковые элементы цоколя из нержавеющей стали. 2 шт.","комп",11699]
["ZA 00.50 S v.2","Боковые элементы цоколя из нержавеющей стали. 2 шт.","комп",10139]
["ZA 00.60 HS v.2","Боковые элементы цоколя из нержавеющей стали. 2 шт.","комп",12344]
["ZA 00.60 S v.2","Боковые элементы цоколя из нержавеющей стали. 2 шт.","комп",10687]
["ZA 00.80 HS v.2","Боковые элементы цоколя из нержавеющей стали. 2 шт.","комп",11698]
["ZA 00.80 S v.2","Боковые элементы цоколя из нержавеющей стали. 2 шт.","комп",9434]
["ZA 00.40 K v.2","Боковые элементы цоколя с щеточным вводом для кабелей, 2 шт.","комп",3058]
["ZA 00.60 K v.2","Боковые элементы цоколя с щеточным вводом для кабелей, 2 шт.","комп",3935]
["ZA 00.80 K v.2","Боковые элементы цоколя с щеточным вводом для кабелей, 2 шт.","комп",7767]
["ZA 00.100 F","Боковые элементы цоколя, 2 шт.","комп",2072]
["ZA 00.100 H v.2","Боковые элементы цоколя, 2 шт.","комп",4903]
["ZA 00.100 v.2","Боковые элементы цоколя, 2 шт.","комп",3214]
["ZA 00.25 v.2","Боковые элементы цоколя, 2 шт.","комп",1210]
["ZA 00.30 F","Боковые элементы цоколя, 2 шт.","комп",862]
["ZA 00.30 v.2","Боковые элементы цоколя, 2 шт.","комп",1380]
["ZA 00.40 FE","Боковые элементы цоколя, 2 шт.","комп",1030]
["ZA 00.40 FP","Боковые элементы цоколя, 2 шт.","комп",1030]
["ZA 00.40 H v.2","Боковые элементы цоколя, 2 шт.","комп",2225]
["ZA 00.40 v.2","Боковые элементы цоколя, 2 шт.","комп",1597]
["ZA 00.50 F","Боковые элементы цоколя, 2 шт.","комп",1210]
["ZA 00.50 H v.2","Боковые элементы цоколя, 2 шт.","комп",2482]
["ZA 00.50 v.2","Боковые элементы цоколя, 2 шт.","комп",1751]
["ZA 00.60 F","Боковые элементы цоколя, 2 шт.","комп",1400]
["ZA 00.60 F RAL7022","Боковые элементы цоколя, 2 шт.","комп",1430]
["ZA 00.60 H v.2","Боковые элементы цоколя, 2 шт.","комп",2668]
["ZA 00.60 v.2","Боковые элементы цоколя, 2 шт.","комп",1957]
["ZA 00.80 F","Боковые элементы цоколя, 2 шт.","комп",1670]
["ZA 00.80 H v.2","Боковые элементы цоколя, 2 шт.","комп",3770]
["ZA 00.80 v.2","Боковые элементы цоколя, 2 шт.","комп",2554]
["ZA 00.80 v.2 RAL7022","Боковые элементы цоколя, 2 шт.","комп",3192]
["GKS 12 M","Ввод кабельный из нержавеющей стали, 10шт.","комп",6516]
["GKS 16 M","Ввод кабельный из нержавеющей стали, 10шт.","комп",10327]
["GKS 20 M","Ввод кабельный из нержавеющей стали, 10шт.","комп",10842]
["GKS 25 M","Ввод кабельный из нержавеющей стали, 10шт.","комп",22550]
["GKS 63 M","Ввод кабельный из нержавеющей стали, 1шт.","шт",12620]
["GKS 40 M","Ввод кабельный из нержавеющей стали, 2шт.","комп",9840]
["GKS 50 M","Ввод кабельный из нержавеющей стали, 2шт.","комп",15960]
["GKS 32 M","Ввод кабельный из нержавеющей стали, 5шт.","комп",17130]
["GKB 12 M","Ввод кабельный латунный, 10шт.","комп",1743]
["GKB 16 M","Ввод кабельный латунный, 10шт.","комп",2103]
["GKB 20 M","Ввод кабельный латунный, 10шт.","комп",3073]
["GKB 25 M","Ввод кабельный латунный, 10шт.","комп",5688]
["GKB 63 M","Ввод кабельный латунный, 1шт.","шт",3780]
["GKB 40 M","Ввод кабельный латунный, 2шт.","комп",2856]
["GKB 50 M","Ввод кабельный латунный, 2шт.","комп",5072]
["GKB 32 M","Ввод кабельный латунный, 5шт.","комп",4123]
["GK 13.8","Ввод кабельный мембранный, 25шт.","комп",12370]
["GK 21.3","Ввод кабельный мембранный, 25шт.","комп",11242]
["GK 47.1","Ввод кабельный мембранный, 25шт.","комп",10577]
["GK 21 PG","Ввод кабельный полиамидный, 15шт.","комп",2022]
["GK 32 M","Ввод кабельный полиамидный, 15шт.","комп",2237]
["GK 16 PG","Ввод кабельный полиамидный, 25шт.","комп",2330]
["GK 25 M","Ввод кабельный полиамидный, 25шт.","комп",4318]
["GK 09 PG","Ввод кабельный полиамидный, 50шт.","комп",1978]
["GK 11 PG","Ввод кабельный полиамидный, 50шт.","комп",2462]
["GK 12 M","Ввод кабельный полиамидный, 50шт.","комп",1967]
["GK 13 PG","Ввод кабельный полиамидный, 50шт.","комп",3013]
["GK 16 M","Ввод кабельный полиамидный, 50шт.","комп",2647]
["GK 20 M","Ввод кабельный полиамидный, 50шт.","комп",2966]
["GK 29 PG","Ввод кабельный полиамидный, 5шт.","комп",1199]
["GK 36 PG","Ввод кабельный полиамидный, 5шт.","комп",1839]
["GK 40 M","Ввод кабельный полиамидный, 5шт.","комп",1360]
["GK 50 M","Ввод кабельный полиамидный, 5шт.","комп",1916]
["G 35.3 B","Ввод щеточный плоский, 2шт.","комп",2603]
["G 48.3 B","Ввод щеточный плоский, 2шт.","комп",4170]
["G 68.3 B","Ввод щеточный плоский, 2шт.","комп",5169]
["G 50.4 B","Ввод щеточный угловой, 2шт.","комп",2957]
["G 60.4 B","Ввод щеточный угловой, 2шт.","комп",4443]
["G 80.4 B","Ввод щеточный угловой, 2шт.","комп",5858]
["LMFI 200.60.60-1600A-OU-1","Вводная панель","шт",901150]
["LMFI 200.60.80-1600A-OU-1","Вводная панель","шт",905150]
["LMFI 200.80.80-2000A-OU-1","Вводная панель","шт",1578650]
["LMFI 200.80.80-2500A-OU-1","Вводная панель","шт",1967250]
["LMFI 200.80.80-3200A-OU-1","Вводная панель","шт",2297950]
["LMFI 200.80.80-4000A-OU-1","Вводная панель","шт",2901550]
["FA 12.230 I","Вентилятор 230В","комп",3420]
["FA 12.024 I","Вентилятор 24В","комп",2006]
["FA 08.230 FD","Вентилятор фильтрующий 230В","шт",2499]
["FA 12.230 FD","Вентилятор фильтрующий 230В","шт",2592]
["FA 13.230 FD","Вентилятор фильтрующий 230В","шт",4560]
["FA 15.230 FD","Вентилятор фильтрующий 230В","шт",5510]
["FA 20.230 FD","Вентилятор фильтрующий 230В","шт",9346]
["FA 08.024 FD","Вентилятор фильтрующий 24В","шт",6829]
["FA 12.024 FD","Вентилятор фильтрующий 24В","шт",13115]
["PPV 15.60","Вертикальный разделитель PPV, 2шт.","комп",882]
["PPV 15.80","Вертикальный разделитель PPV, 2шт.","комп",1265]
["PPV 17.60","Вертикальный разделитель PPV, 2шт.","комп",1108]
["PPV 30.60","Вертикальный разделитель PPV, 2шт.","комп",1792]
["PPV 30.80","Вертикальный разделитель PPV, 2шт.","комп",2344]
["PPV 40.60","Вертикальный разделитель PPV, 2шт.","комп",2344]
["PPV 40.80","Вертикальный разделитель PPV, 2шт.","комп",3080]
["PPV 50.60","Вертикальный разделитель PPV, 2шт.","комп",3449]
["PPV 50.80","Вертикальный разделитель PPV, 2шт.","комп",3922]
["PPV 60.60","Вертикальный разделитель PPV, 2шт.","комп",3449]
["PPV 60.80","Вертикальный разделитель PPV, 2шт.","комп",4554]
["PPV 75.60","Вертикальный разделитель PPV, 2шт.","комп",4554]
["PPV 75.80","Вертикальный разделитель PPV, 2шт.","комп",8921]
["PPV 85.80","Вертикальный разделитель PPV, 2шт.","комп",8921]
["ZB 22.16","Верхний разделитель ZB","шт",1430]
["ZB 23.16","Верхний разделитель ZB","шт",1030]
["ZB 29.16","Верхний разделитель ZB","шт",1210]
["MCS 56.120.24 U","Верхняя часть пульта","шт",42508]
["MCS 56.160.24 U","Верхняя часть пульта","шт",44681]
["MCS 56.80.24 U","Верхняя часть пульта","шт",31961]
["S 6.25 MXS","Винт крепежный нержавеющий, 50шт.","комп",1446]
["S 5.16 M","Винт крепежный, 100шт.","комп",2005]
["S 6.10 MX","Винт крепежный, 100шт.","комп",1576]
["S 6.16 M","Винт крепежный, 100шт.","комп",2547]
["S 6.16 MX","Винт крепежный, 100шт.","комп",3550]
["S 8.16 MX","Винт крепежный, 100шт.","комп",5300]
["S 5.12 FT","Винт резьбовыдавливающий, 100шт.","комп",2688]
["S 5.11","Винт самонарезающий, 100шт.","комп",1360]
["S 5.13 T","Винт самонарезающий, 100шт.","комп",829]
["SB 5 P","Втулка пластиковая для коробок, 100 шт.","комп",3590]
["SW 01","Выключатель концевой","шт",2730]
["N 4 DR","Гайка для установки на DIN-рейку, 100шт.","комп",16489]
["N 4 MR","Гайка закладная прямоугольная, 100шт.","комп",2910]
["N 5 MR","Гайка закладная прямоугольная, 100шт.","комп",3879]
["N 6 MR","Гайка закладная прямоугольная, 100шт.","комп",2909]
["N 5 MS","Гайка закладная, 100шт.","комп",4334]
["N 6 MS","Гайка закладная, 100шт.","комп",3381]
["N 8 MS","Гайка закладная, 100шт.","комп",6739]
["N 5 MF","Гайка с фланцем, 100шт.","комп",536]
["N 6 MF","Гайка с фланцем, 100шт.","комп",963]
["N 8 MF","Гайка с фланцем, 100шт.","комп",1131]
["HS 5.230 D","Гигростат","шт",7560]
["PPH 20.60","Горизонтальный разделитель PPH, 2шт.","комп",1888]
["PPH 20.80","Горизонтальный разделитель PPH, 2шт.","комп",2756]
["PPH 36.60","Горизонтальный разделитель PPH, 2шт.","комп",2756]
["PPH 36.80","Горизонтальный разделитель PPH, 2шт.","комп",3887]
["PPH 40.80","Горизонтальный разделитель PPH, 2шт.","комп",3046]
["PPH 60.60","Горизонтальный разделитель PPH, 2шт.","комп",3824]
["PPH 60.80","Горизонтальный разделитель PPH, 2шт.","комп",4519]
["PPH 80.60","Горизонтальный разделитель PPH, 2шт.","комп",4519]
["PPH 80.80","Горизонтальный разделитель PPH, 2шт.","комп",9952]
["ID 100.60","Дверь внутренняя для компактных шкафов","шт",8487]
["ID 100.80","Дверь внутренняя для компактных шкафов","шт",9342]
["ID 120.60","Дверь внутренняя для компактных шкафов","шт",10483]
["ID 120.80","Дверь внутренняя для компактных шкафов","шт",11262]
["ID 140.80","Дверь внутренняя для компактных шкафов","шт",17046]
["ID 50.40","Дверь внутренняя для компактных шкафов","шт",4151]
["ID 60.40","Дверь внутренняя для компактных шкафов","шт",4388]
["ID 70.50","Дверь внутренняя для компактных шкафов","шт",5655]
["ID 80.60","Дверь внутренняя для компактных шкафов","шт",7508]
["ID 180.60","Дверь внутренняя для шкафа MPx","шт",20911]
["ID 180.80","Дверь внутренняя для шкафа MPx","шт",14647]
["ID 200.60","Дверь внутренняя для шкафа MPx","шт",13472]
["ID 200.80","Дверь внутренняя для шкафа MPx","шт",16089]
["ID 220.60","Дверь внутренняя для шкафа MPx","шт",21274]
["ID 220.80","Дверь внутренняя для шкафа MPx","шт",26334]
["D 180.80 S ","Дверь глухая из нержавеющей стали для шкафа MPx","шт",71120]
["D 200.60 S ","Дверь глухая из нержавеющей стали для шкафа MPx","шт",61270]
["D 200.80 S ","Дверь глухая из нержавеющей стали для шкафа MPx","шт",86270]
["D 120.60","Дверь для шкафа MPx","шт",22753]
["D 120.60 RAL7004","Дверь для шкафа MPx","шт",23232]
["D 120.60 RAL9005","Дверь для шкафа MPx","шт",23272]
["D 120.80","Дверь для шкафа MPx","шт",21800]
["D 140.60","Дверь для шкафа MPx","шт",19521]
["D 140.60 RAL7004","Дверь для шкафа MPx","шт",25975]
["D 160.40","Дверь для шкафа MPx","шт",17616]
["D 160.60","Дверь для шкафа MPx","шт",23827]
["D 160.60 RAL7004","Дверь для шкафа MPx","шт",26165]
["D 160.80","Дверь для шкафа MPx","шт",30333]
["D 180.100 D","Дверь для шкафа MPx","шт",42697]
["D 180.100 D RAL7004","Дверь для шкафа MPx","шт",45091]
["D 180.120 D","Дверь для шкафа MPx","шт",39093]
["D 180.40","Дверь для шкафа MPx","шт",19100]
["D 180.40 RAL7004","Дверь для шкафа MPx","шт",22982]
["D 180.60","Дверь для шкафа MPx","шт",24124]
["D 180.60 RAL3020","Дверь для шкафа MPx","шт",26978]
["D 180.60 RAL7004","Дверь для шкафа MPx","шт",25480]
["D 180.80","Дверь для шкафа MPx","шт",23058]
["D 180.80 D","Дверь для шкафа MPx","шт",45565]
["D 180.80 D RAL7004","Дверь для шкафа MPx","шт",45139]
["D 180.80 D RAL9005","Дверь для шкафа MPx","шт",50543]
["D 180.80 RAL3020","Дверь для шкафа MPx","шт",28930]
["D 180.80 RAL7004","Дверь для шкафа MPx","шт",28806]
["D 200.100","Дверь для шкафа MPx","шт",33286]
["D 200.100 D","Дверь для шкафа MPx","шт",43359]
["D 200.100 D RAL3020","Дверь для шкафа MPx","шт",46054]
["D 200.100 D RAL7004","Дверь для шкафа MPx","шт",47074]
["D 200.120 D","Дверь для шкафа MPx","шт",43113]
["D 200.120 D RAL3020","Дверь для шкафа MPx","шт",53505]
["D 200.120 D RAL7004","Дверь для шкафа MPx","шт",55821]
["D 200.40","Дверь для шкафа MPx","шт",22274]
["D 200.40 RAL7004","Дверь для шкафа MPx","шт",24183]
["D 200.60","Дверь для шкафа MPx","шт",24615]
["D 200.60 D","Дверь для шкафа MPx","шт",34642]
["D 200.60 RAL3020","Дверь для шкафа MPx","шт",27275]
["D 200.60 RAL7004","Дверь для шкафа MPx","шт",27011]
["D 200.60 RAL9005","Дверь для шкафа MPx","шт",27086]
["D 200.80","Дверь для шкафа MPx","шт",28556]
["D 200.80 D","Дверь для шкафа MPx","шт",34718]
["D 200.80 D RAL7004","Дверь для шкафа MPx","шт",44218]
["D 200.80 RAL3020","Дверь для шкафа MPx","шт",29523]
["D 200.80 RAL7004","Дверь для шкафа MPx","шт",30958]
["D 200.80 RAL9005","Дверь для шкафа MPx","шт",31058]
["D 220.100 D","Дверь для шкафа MPx","шт",49952]
["D 220.100 D RAL7004","Дверь для шкафа MPx","шт",56714]
["D 220.120 D","Дверь для шкафа MPx","шт",43493]
["D 220.120 D RAL7004","Дверь для шкафа MPx","шт",52752]
["D 220.40","Дверь для шкафа MPx","шт",25590]
["D 220.60","Дверь для шкафа MPx","шт",27334]
["D 220.60 RAL3020","Дверь для шкафа MPx","шт",30822]
["D 220.60 RAL7004","Дверь для шкафа MPx","шт",30963]
["D 220.80","Дверь для шкафа MPx","шт",28647]
["D 220.80 D","Дверь для шкафа MPx","шт",47230]
["D 220.80 D RAL7004","Дверь для шкафа MPx","шт",54316]
["D 220.80 RAL3020","Дверь для шкафа MPx","шт",32303]
["D 220.80 RAL7004","Дверь для шкафа MPx","шт",31674]
["D 120.60 V","Дверь обзорная для шкафа MPV","шт",31998]
["D 120.80 V","Дверь обзорная для шкафа MPV","шт",40477]
["D 160.60 V","Дверь обзорная для шкафа MPV","шт",37386]
["D 180.40 V","Дверь обзорная для шкафа MPV","шт",27709]
["D 180.60 V","Дверь обзорная для шкафа MPV","шт",33421]
["D 180.80 V","Дверь обзорная для шкафа MPV","шт",41215]
["D 200.40 V","Дверь обзорная для шкафа MPV","шт",28650]
["D 200.60 V","Дверь обзорная для шкафа MPV","шт",37399]
["D 200.80 V","Дверь обзорная для шкафа MPV","шт",42439]
["D 220.60 V","Дверь обзорная для шкафа MPV","шт",38582]
["D 220.80 V","Дверь обзорная для шкафа MPV","шт",45327]
["D 220.80 V RAL9005","Дверь обзорная для шкафа MPV","шт",54354]
["D 100.60 VE","Дверь обзорная шкафа MEV","шт",12485]
["D 100.80 VE","Дверь обзорная шкафа MEV","шт",16127]
["D 70.50 VE","Дверь обзорная шкафа MEV","шт",7833]
["D 80.60 VE","Дверь обзорная шкафа MEV","шт",10238]
["D 120.60 P","Дверь перфорированная для шкафа MPP","шт",24119]
["D 120.60 P RAL9005","Дверь перфорированная для шкафа MPP","шт",28594]
["D 180.60 P","Дверь перфорированная для шкафа MPP","шт",32690]
["D 180.80 P","Дверь перфорированная для шкафа MPP","шт",44200]
["D 200.60 P","Дверь перфорированная для шкафа MPP","шт",40013]
["D 200.80 P","Дверь перфорированная для шкафа MPP","шт",51664]
["D 200.80 P RAL9005","Дверь перфорированная для шкафа MPP","шт",58257]
["D 200.80 PD","Дверь перфорированная для шкафа MPP","шт",53242]
["D 220.60 P","Дверь перфорированная для шкафа MPP","шт",39203]
["D 220.80 P","Дверь перфорированная для шкафа MPP","шт",52220]
["D 100.60 M","Дверь секционная","шт",11231]
["D 100.80 M","Дверь секционная","шт",12403]
["D 20.60 M","Дверь секционная","шт",5106]
["D 20.80 M","Дверь секционная","шт",5478]
["D 40.60 M","Дверь секционная","шт",6191]
["D 40.80 M","Дверь секционная","шт",6755]
["D 60.60 M","Дверь секционная","шт",8206]
["D 60.60 M RAL3020","Дверь секционная","шт",9458]
["D 60.60 M RAL7004","Дверь секционная","шт",9377]
["D 60.80 M","Дверь секционная","шт",8111]
["D 80.60 M","Дверь секционная","шт",8657]
["D 80.60 M RAL3020","Дверь секционная","шт",10542]
["D 80.60 M RAL7004","Дверь секционная","шт",10137]
["D 80.80 M","Дверь секционная","шт",9518]
["D 40.60 MV","Дверь секционная обзорная","шт",9618]
["D 40.80 MV","Дверь секционная обзорная","шт",11630]
["D 60.60 MV","Дверь секционная обзорная","шт",11798]
["D 60.80 MV","Дверь секционная обзорная","шт",14263]
["D 80.60 MV","Дверь секционная обзорная","шт",14039]
["D 80.80 MV","Дверь секционная обзорная","шт",17353]
["D 20.60 MK","Дверь секционная откидная","шт",5869]
["D 20.60 MK RAL7004","Дверь секционная откидная","шт",6026]
["D 120.60 I","Дверь телекоммуникационная","шт",13070]
["D 120.80 I","Дверь телекоммуникационная","шт",14370]
["D 180.60 I","Дверь телекоммуникационная","шт",17882]
["D 180.80 I","Дверь телекоммуникационная","шт",19936]
["D 200.60 I","Дверь телекоммуникационная","шт",17550]
["D 200.80 I","Дверь телекоммуникационная","шт",20171]
["D 220.60 I","Дверь телекоммуникационная","шт",16642]
["D 220.80 I","Дверь телекоммуникационная","шт",19886]
["D 120.60 IV","Дверь телекоммуникационная обзорная","шт",22661]
["D 120.80 IV","Дверь телекоммуникационная обзорная","шт",23916]
["D 180.60 IV","Дверь телекоммуникационная обзорная","шт",27910]
["D 180.80 IV","Дверь телекоммуникационная обзорная","шт",30934]
["D 200.60 IV","Дверь телекоммуникационная обзорная","шт",30038]
["D 200.80 IV","Дверь телекоммуникационная обзорная","шт",34765]
["D 220.60 IV","Дверь телекоммуникационная обзорная","шт",30856]
["D 220.80 IV","Дверь телекоммуникационная обзорная","шт",37150]
["D 120.60 IP v.2","Дверь телекоммуникационная перфорированная","шт",31674]
["D 180.60 IP v.2","Дверь телекоммуникационная перфорированная","шт",32370]
["D 200.60 IP v.2","Дверь телекоммуникационная перфорированная","шт",40210]
["D 120.60 IK","Дверь телекоммуникационная укороченная с щеточным вводом для кабелей","шт",9195]
["D 120.80 IK","Дверь телекоммуникационная укороченная с щеточным вводом для кабелей","шт",13261]
["D 180.60 IK","Дверь телекоммуникационная укороченная с щеточным вводом для кабелей","шт",13888]
["D 180.80 IK","Дверь телекоммуникационная укороченная с щеточным вводом для кабелей","шт",17562]
["D 200.60 IK","Дверь телекоммуникационная укороченная с щеточным вводом для кабелей","шт",13944]
["D 200.80 IK","Дверь телекоммуникационная укороченная с щеточным вводом для кабелей","шт",16184]
["D 220.60 IK","Дверь телекоммуникационная укороченная с щеточным вводом для кабелей","шт",11637]
["D 220.80 IK","Дверь телекоммуникационная укороченная с щеточным вводом для кабелей","шт",16285]
["B 6 DR","Держатель DIN-рейки, 10шт.","комп",1965]
["B 5.35 DR","Держатель DIN-рейки, 20шт.","комп",3420]
["B 0 B","Держатель крышки, 2шт.","комп",775]
["B 6 SP","Держатель панелей, 8шт.","комп",5275]
["MP M","Держатель панели монтажной секционной, 2шт.","комп",411]
["B 8.8 MG","Держатель траверсы вертикальный, 6 комплектов","комп",4491]
["B 8 MG","Держатель траверсы, 6 комплектов","комп",4170]
["BI 2","Держатель шинных сборок","комп",4175]
["BI 3","Держатель шинных сборок","комп",6273]
["BI 3.3","Держатель шинных сборок 4000А","комп",8718]
["BI 3 U","Держатель шинных сборок, 2шт.","комп",3952]
["PL 06","Заглушка пластиковая 6,6мм, 100шт.","комп",680]
["PL 09","Заглушка пластиковая 9,3мм, 4шт.","комп",137]
["CL 12","Зажим кабельный, 25шт.","комп",4759]
["CL 18","Зажим кабельный, 25шт.","комп",4321]
["CL 22","Зажим кабельный, 25шт.","комп",5263]
["CL 30","Зажим кабельный, 25шт.","комп",6139]
["CL 38","Зажим кабельный, 25шт.","комп",6386]
["CL 42","Зажим кабельный, 25шт.","комп",6685]
["CL 50","Зажим кабельный, 25шт.","комп",10980]
["CL 64","Зажим кабельный, 25шт.","комп",13339]
["CK 05.04","Зажим шинный, 15шт.","комп",2593]
["CK 05.16","Зажим шинный, 15шт.","комп",2052]
["CK 05.185","Зажим шинный, 15шт.","комп",5037]
["CK 05.50","Зажим шинный, 15шт.","комп",4089]
["CK 05.70","Зажим шинный, 15шт.","комп",5003]
["CK 10.04","Зажим шинный, 15шт.","комп",1748]
["CK 10.16","Зажим шинный, 15шт.","комп",2152]
["CK 10.185","Зажим шинный, 15шт.","комп",5037]
["CK 10.50","Зажим шинный, 15шт.","комп",4855]
["CK 10.70","Зажим шинный, 15шт.","комп",4418]
["LC 5 DB.S","Замок нержавеющий с двойной бородкой ","шт",4071]
["LC 5 DB.ZS","Замок с покрытием сатин с двойной бородкой в сборе","шт",850]
["LC 5 DB.Z","Замок цинковый с двойной бородкой в сборе","шт",874]
["LC 1C.Z","Замок цинковый с цилиндром","шт",1308]
["LC 1C.ZH","Замок цинковый с цилиндром и поворотной ручкой","шт",3214]
["B 6 DP","Захват штанговой системы, 4шт.","комп",3158]
["PP 200.120 MC","Защита от прикосновения","комп",3942]
["PP 200.40 MC","Защита от прикосновения","комп",3170]
["PP 200.80 MC","Защита от прикосновения","комп",3232]
["PP 220.80 MC","Защита от прикосновения","комп",3987]
["PP 200.80 IT","Защита от прикосновения 19''-реек","комп",4279]
["R 08 FA","Защитный кожух для вентилятора фильтрующего","шт",2072]
["R 12 FA","Защитный кожух для вентилятора фильтрующего","шт",2236]
["R 13 FA","Защитный кожух для вентилятора фильтрующего","шт",2632]
["R 15 FA","Защитный кожух для вентилятора фильтрующего","шт",3056]
["R 20 FA","Защитный кожух для вентилятора фильтрующего","шт",3841]
["R 08 FA S","Защитный кожух для вентилятора фильтрующего из нержавеющей стали","шт",6448]
["R 12 FA S","Защитный кожух для вентилятора фильтрующего из нержавеющей стали","шт",7406]
["R 13 FA S","Защитный кожух для вентилятора фильтрующего из нержавеющей стали","шт",10331]
["R 15 FA S","Защитный кожух для вентилятора фильтрующего из нержавеющей стали","шт",14264]
["R 20 FA S","Защитный кожух для вентилятора фильтрующего из нержавеющей стали","шт",16748]
["BI 30","Изолятор опорный, 6шт.","комп",2009]
["BI 45","Изолятор опорный, 6шт.","комп",2222]
["BI 51","Изолятор опорный, 6шт.","комп",4002]
["CR 200.20","Кабельная панель","шт",7336]
["CR 220.20","Кабельная панель","шт",6550]
["LMFC 200.40.60-1600A-OU-1","Кабельный отсек","шт",233350]
["LMFC 200.40.80-1600A-OU-1","Кабельный отсек","шт",234950]
["LMFC 200.40.80-2000A-OU-1","Кабельный отсек","шт",259750]
["LMFC 200.40.80-2500A-OU-1","Кабельный отсек","шт",292850]
["LMFC 200.40.80-3200A-OU-1","Кабельный отсек","шт",359000]
["LMFC 200.40.80-4000A-OU-1","Кабельный отсек","шт",408600]
["LMFC 200.60.60-1600A-OU-1","Кабельный отсек","шт",290850]
["LMFC 200.60.80-1600A-OU-1","Кабельный отсек","шт",294000]
["LMFC 200.60.80-2000A-OU-1","Кабельный отсек","шт",376700]
["LMFC 200.60.80-2500A-OU-1","Кабельный отсек","шт",393200]
["LMFC 200.60.80-3200A-OU-1","Кабельный отсек","шт",500700]
["LMFC 200.60.80-4000A-OU-1","Кабельный отсек","шт",500700]
["DP 40 M","Карман для документации металлический","шт",1380]
["DP 50 M","Карман для документации металлический","шт",1576]
["DP 60 M","Карман для документации металлический","шт",1710]
["DP 80 M","Карман для документации металлический","шт",2019]
["DP 40 P","Карман для документации пластиковый","шт",792]
["KY 1T.Z","Ключ цинковый и вставка с треугольником","комп",{"$error":"#N/A"}]
["KY 2T.Z","Ключ цинковый и замок с треугольником","комп",1501]
["KY 5 DB.Z","Ключ цинковый с двойной бородкой","шт",268]
["R 100.40","Козырек защитный для шкафа MPx","шт",5063]
["R 100.60","Козырек защитный для шкафа MPx","шт",8454]
["R 100.60 RAL7004","Козырек защитный для шкафа MPx","шт",8414]
["R 100.80","Козырек защитный для шкафа MPx","шт",10694]
["R 120.40","Козырек защитный для шкафа MPx","шт",5914]
["R 120.50","Козырек защитный для шкафа MPx","шт",6541]
["R 120.60","Козырек защитный для шкафа MPx","шт",9044]
["R 120.60 RAL7004","Козырек защитный для шкафа MPx","шт",9632]
["R 120.80","Козырек защитный для шкафа MPx","шт",10506]
["R 160.60","Козырек защитный для шкафа MPx","шт",10696]
["R 60.40","Козырек защитный для шкафа MPx","шт",4435]
["R 60.50","Козырек защитный для шкафа MPx","шт",4838]
["R 60.60","Козырек защитный для шкафа MPx","шт",5421]
["R 60.60 RAL7004","Козырек защитный для шкафа MPx","шт",6205]
["R 60.80","Козырек защитный для шкафа MPx","шт",7857]
["R 80.40","Козырек защитный для шкафа MPx","шт",4883]
["R 80.50","Козырек защитный для шкафа MPx","шт",5398]
["R 80.60","Козырек защитный для шкафа MPx","шт",6252]
["R 80.60 RAL7004","Козырек защитный для шкафа MPx","шт",7302]
["R 80.80","Козырек защитный для шкафа MPx","шт",8299]
["R 20.15","Козырек защитный для шкафов MEx","шт",2600]
["R 30.15","Козырек защитный для шкафов MEx","шт",2960]
["R 30.21","Козырек защитный для шкафов MEx","шт",3192]
["R 40.15","Козырек защитный для шкафов MEx","шт",2800]
["R 40.21","Козырек защитный для шкафов MEx","шт",3652]
["R 40.25","Козырек защитный для шкафов MEx","шт",3595]
["R 50.21","Козырек защитный для шкафов MEx","шт",3873]
["R 50.25","Козырек защитный для шкафов MEx","шт",3516]
["R 50.25 RAL9005","Козырек защитный для шкафов MEx","шт",3580]
["R 60.21","Козырек защитный для шкафов MEx","шт",3801]
["R 60.25","Козырек защитный для шкафов MEx","шт",4226]
["R 60.30","Козырек защитный для шкафов MEx","шт",4763]
["R 60.30 RAL3020","Козырек защитный для шкафов MEx","шт",4796]
["R 60.30 RAL7004","Козырек защитный для шкафов MEx","шт",4210]
["R 80.30","Козырек защитный для шкафов MEx","шт",5197]
["R 80.30 RAL7004","Козырек защитный для шкафов MEx","шт",4957]
["R 120.40 S","Козырек защитный из нержавеющей стали","шт",24860]
["R 120.50 S","Козырек защитный из нержавеющей стали","шт",21527]
["R 120.60 S","Козырек защитный из нержавеющей стали","шт",31259]
["R 60.50 S","Козырек защитный из нержавеющей стали","шт",20000]
["R 60.60 S","Козырек защитный из нержавеющей стали","шт",21235]
["R 80.50 S","Козырек защитный из нержавеющей стали","шт",22400]
["R 80.60 S","Козырек защитный из нержавеющей стали","шт",22280]
["R 100.30 S","Козырек защитный из нержавеющей стали для шкафов SES","шт",15060]
["R 30.15 S","Козырек защитный из нержавеющей стали для шкафов SES","шт",3439]
["R 40.21 S","Козырек защитный из нержавеющей стали для шкафов SES","шт",7502]
["R 50.21 S","Козырек защитный из нержавеющей стали для шкафов SES","шт",7158]
["R 50.25 S","Козырек защитный из нержавеющей стали для шкафов SES","шт",13585]
["R 60.21 S","Козырек защитный из нержавеющей стали для шкафов SES","шт",8438]
["R 60.25 S","Козырек защитный из нержавеющей стали для шкафов SES","шт",13585]
["R 60.30 S","Козырек защитный из нержавеющей стали для шкафов SES","шт",13585]
["R 80.30 S","Козырек защитный из нержавеющей стали для шкафов SES","шт",11820]
["ZBS 22.14.16","Коммутационная коробка боковая ZBS","комп",11510]
["ZBS 23.19.16","Коммутационная коробка боковая ZBS","комп",12080]
["ZBS 29.24.16","Коммутационная коробка боковая ZBS","комп",15400]
["IK 200.20 MC","Комплект адаптации модульной рамы с отсеком сборных шин","комп",10819]
["IK 06 MP","Комплект для крепления монтажной панели","комп",1635]
["IK 06 MPO","Комплект для крепления монтажной панели","комп",1411]
["PC 1 LH.M","Комплект для пломбирования","шт",773]
["PI 75 VT","Комплект для установки трансформатора напряжения в отсеке выкатного элемента","комп",{"$error":"#N/A"}]
["IK 03 MR","Комплект доработки нижних частей пультов MCx до требований Морского Регистра","комп",2010]
["IK 02 MR","Комплект доработки шкафов IPx до требований Морского Регистра","комп",1030]
["EK 8 E","Комплект заземления внешний М8, комп.","комп",605]
["EK 6","Комплект заземления М6, 10шт.","комп",793]
["EK 8","Комплект заземления М8, 10шт.","комп",1051]
["OK 30 EP","Комплект крепления к опоре","комп",6440]
["OK 40 EP","Комплект крепления к опоре","комп",7864]
["OK 50 EP","Комплект крепления к опоре","комп",8405]
["OK 60 EP","Комплект крепления к опоре","комп",7381]
["OK 80 EP","Комплект крепления к опоре","комп",10090]
["IK 02 MP","Комплект крепления монтажной панели верхний, комп.","комп",686]
["IK 01 MP","Комплект крепления монтажной панели нижний, комп.","комп",582]
["IK 01 EQ 120.80.50","Комплект усилителей сейсмостойкий","комп",22725]
["IK 01 EQ 160.60.50","Комплект усилителей сейсмостойкий","комп",36390]
["IK 01 EQ 160.60.60","Комплект усилителей сейсмостойкий","комп",29453]
["IK 01 EQ 160.60.80","Комплект усилителей сейсмостойкий","комп",32370]
["IK 01 EQ 160.80.60","Комплект усилителей сейсмостойкий","комп",35390]
["IK 01 EQ 180.120.60","Комплект усилителей сейсмостойкий","комп",51390]
["IK 01 EQ 180.60.100","Комплект усилителей сейсмостойкий","комп",42076]
["IK 01 EQ 180.60.40","Комплект усилителей сейсмостойкий","комп",32230]
["IK 01 EQ 180.60.50","Комплект усилителей сейсмостойкий","комп",25992]
["IK 01 EQ 180.60.60","Комплект усилителей сейсмостойкий","комп",32230]
["IK 01 EQ 180.60.80","Комплект усилителей сейсмостойкий","комп",34480]
["IK 01 EQ 180.80.40","Комплект усилителей сейсмостойкий","комп",38057]
["IK 01 EQ 180.80.60","Комплект усилителей сейсмостойкий","комп",32230]
["IK 01 EQ 180.80.80","Комплект усилителей сейсмостойкий","комп",32480]
["IK 01 EQ 200.100.60","Комплект усилителей сейсмостойкий","комп",33590]
["IK 01 EQ 200.120.40","Комплект усилителей сейсмостойкий","комп",40480]
["IK 01 EQ 200.120.60","Комплект усилителей сейсмостойкий","комп",31923]
["IK 01 EQ 200.120.80","Комплект усилителей сейсмостойкий","комп",39590]
["IK 01 EQ 200.40.40","Комплект усилителей сейсмостойкий","комп",25440]
["IK 01 EQ 200.40.60","Комплект усилителей сейсмостойкий","комп",31150]
["IK 01 EQ 200.60.40","Комплект усилителей сейсмостойкий","комп",32230]
["IK 01 EQ 200.60.60","Комплект усилителей сейсмостойкий","комп",30624]
["IK 01 EQ 200.60.80","Комплект усилителей сейсмостойкий","комп",29424]
["IK 01 EQ 200.80.100","Комплект усилителей сейсмостойкий","комп",37173]
["IK 01 EQ 200.80.40","Комплект усилителей сейсмостойкий","комп",28900]
["IK 01 EQ 200.80.60","Комплект усилителей сейсмостойкий","комп",35855]
["IK 01 EQ 200.80.80","Комплект усилителей сейсмостойкий","комп",37901]
["IK 01 EQ 220.120.60","Комплект усилителей сейсмостойкий","комп",36557]
["IK 01 EQ 220.60.100","Комплект усилителей сейсмостойкий","комп",43170]
["IK 01 EQ 220.60.40","Комплект усилителей сейсмостойкий","комп",37150]
["IK 01 EQ 220.60.60","Комплект усилителей сейсмостойкий","комп",35706]
["IK 01 EQ 220.60.80","Комплект усилителей сейсмостойкий","комп",32052]
["IK 01 EQ 220.80.60","Комплект усилителей сейсмостойкий","комп",38138]
["IK 01 EQ 220.80.80","Комплект усилителей сейсмостойкий","комп",32304]
["FB 60.60","Комплект установки 3WL","комп",{"$error":"#N/A"}]
["FB 60.80","Комплект установки 3WL","комп",{"$error":"#N/A"}]
["AC 1000 D","Кондиционер навесной 230В","шт",169593]
["AC 1500 D","Кондиционер навесной 230В","шт",223866]
["AC 2000 D","Кондиционер навесной 230В","шт",220060]
["AC 2500 D","Кондиционер навесной 230В","шт",256233]
["AC 300 D","Кондиционер навесной 230В","шт",101373]
["AC 500 D","Кондиционер навесной 230В","шт",136137]
["AC 800 D","Кондиционер навесной 230В","шт",147246]
["AC 1000 R","Кондиционер потолочный 230В","шт",159866]
["AC 1500 R","Кондиционер потолочный 230В","шт",183870]
["AC 2000 R","Кондиционер потолочный 230В","шт",224097]
["AC 500 R","Кондиционер потолочный 230В","шт",132015]
["AC 800 R","Кондиционер потолочный 230В","шт",147764]
["B 6 IG","Консоль для реек вертикальных 19\" IT, 4шт.","комп",2010]
["B 6 G","Консоль для реек вертикальных 19\", 4шт.","комп",2184]
["B 6.23 G","Консоль для реек вертикальных 23\", 4шт.","комп",941]
["B 6 GB","Консоль опорная, 4шт.","комп",3986]
["MBS 10.10.06 Ex","Коробка взрывозащищенная","шт",3035]
["MBS 12.12.06 Ex","Коробка взрывозащищенная","шт",2934]
["MBS 15.15.08 Ex","Коробка взрывозащищенная","шт",4513]
["MBS 15.30.08 Ex","Коробка взрывозащищенная","шт",5137]
["MBS 20.20.08 Ex","Коробка взрывозащищенная","шт",4911]
["MBS 20.30.08 Ex","Коробка взрывозащищенная","шт",5366]
["MBS 30.30.12 Ex","Коробка взрывозащищенная","шт",6552]
["MBS 30.40.12 Ex","Коробка взрывозащищенная","шт",7907]
["MBS 40.60.12 Ex","Коробка взрывозащищенная","шт",11962]
["SBS 10.10.06 Ex","Коробка взрывозащищенная из нержавеющей стали","шт",8062]
["SBS 12.12.06 Ex","Коробка взрывозащищенная из нержавеющей стали","шт",8355]
["SBS 15.15.08 Ex","Коробка взрывозащищенная из нержавеющей стали","шт",15965]
["SBS 15.30.08 Ex","Коробка взрывозащищенная из нержавеющей стали","шт",19345]
["SBS 20.20.08 Ex","Коробка взрывозащищенная из нержавеющей стали","шт",19176]
["SBS 20.30.08 Ex","Коробка взрывозащищенная из нержавеющей стали","шт",21730]
["SBS 30.30.12 Ex","Коробка взрывозащищенная из нержавеющей стали","шт",26464]
["SBS 30.40.12 Ex","Коробка взрывозащищенная из нержавеющей стали","шт",26492]
["SBS 40.60.12 Ex","Коробка взрывозащищенная из нержавеющей стали","шт",44666]
["MBV 20.20.08 Ex","Коробка взрывозащищенная с обзорной крышкой","шт",8079]
["MBV 20.30.08 Ex","Коробка взрывозащищенная с обзорной крышкой","шт",8929]
["MBV 30.30.12 Ex","Коробка взрывозащищенная с обзорной крышкой","шт",10763]
["MBV 30.40.12 Ex","Коробка взрывозащищенная с обзорной крышкой","шт",11307]
["MBS 10.10.06","Коробка распределительная","шт",1967]
["MBS 10.10.06 RAL3020","Коробка распределительная","шт",2206]
["MBS 10.15.06","Коробка распределительная","шт",2016]
["MBS 12.12.06","Коробка распределительная","шт",1971]
["MBS 15.15.06","Коробка распределительная","шт",2072]
["MBS 15.15.08","Коробка распределительная","шт",2673]
["MBS 15.15.12","Коробка распределительная","шт",3062]
["MBS 15.15.12 RAL3020","Коробка распределительная","шт",4043]
["MBS 15.15.12 RAL7032","Коробка распределительная","шт",4043]
["MBS 15.20.08","Коробка распределительная","шт",2610]
["MBS 15.20.12","Коробка распределительная","шт",3278]
["MBS 15.30.08","Коробка распределительная","шт",2930]
["MBS 15.30.12","Коробка распределительная","шт",3653]
["MBS 20.20.08","Коробка распределительная","шт",3013]
["MBS 20.20.08 RAL3020","Коробка распределительная","шт",3392]
["MBS 20.20.12","Коробка распределительная","шт",3825]
["MBS 20.30.08","Коробка распределительная","шт",2916]
["MBS 20.30.08 RAL7004","Коробка распределительная","шт",3885]
["MBS 20.30.12","Коробка распределительная","шт",4162]
["MBS 20.30.12 RAL7004","Коробка распределительная","шт",4934]
["MBS 20.40.08","Коробка распределительная","шт",3481]
["MBS 20.40.12","Коробка распределительная","шт",4532]
["MBS 20.60.08","Коробка распределительная","шт",6459]
["MBS 30.30.08","Коробка распределительная","шт",4603]
["MBS 30.30.12","Коробка распределительная","шт",5177]
["MBS 30.30.12 RAL3020","Коробка распределительная","шт",6899]
["MBS 30.40.08","Коробка распределительная","шт",5253]
["MBS 30.40.12","Коробка распределительная","шт",5740]
["MBS 30.60.08","Коробка распределительная","шт",5947]
["MBS 30.60.12","Коробка распределительная","шт",8818]
["MBS 40.40.12","Коробка распределительная","шт",7180]
["MBS 40.60.12","Коробка распределительная","шт",8779]
["MBS 40.80.12","Коробка распределительная","шт",12211]
["SBS 10.10.06","Коробка распределительная из нержавеющей стали","шт",7045]
["SBS 12.12.06","Коробка распределительная из нержавеющей стали","шт",7986]
["SBS 15.15.08","Коробка распределительная из нержавеющей стали","шт",11941]
["SBS 15.20.08","Коробка распределительная из нержавеющей стали","шт",16140]
["SBS 15.30.08","Коробка распределительная из нержавеющей стали","шт",14950]
["SBS 20.20.08","Коробка распределительная из нержавеющей стали","шт",13357]
["SBS 20.20.12","Коробка распределительная из нержавеющей стали","шт",20126]
["SBS 20.30.08","Коробка распределительная из нержавеющей стали","шт",15996]
["SBS 20.50.12","Коробка распределительная из нержавеющей стали","шт",25296]
["SBS 30.30.12","Коробка распределительная из нержавеющей стали","шт",22477]
["SBS 30.40.12","Коробка распределительная из нержавеющей стали","шт",25406]
["MBV 20.20.12","Коробка распределительная с обзорной крышкой","шт",7997]
["MBV 20.20.12 RAL3020","Коробка распределительная с обзорной крышкой","шт",6944]
["MBV 20.20.12 RAL7004","Коробка распределительная с обзорной крышкой","шт",6922]
["MBV 20.30.12","Коробка распределительная с обзорной крышкой","шт",7616]
["MBV 20.40.12","Коробка распределительная с обзорной крышкой","шт",8747]
["MBV 30.30.12","Коробка распределительная с обзорной крышкой","шт",8971]
["MBV 30.40.12","Коробка распределительная с обзорной крышкой","шт",9340]
["MBV 30.60.12","Коробка распределительная с обзорной крышкой","шт",11532]
["MBV 40.40.12","Коробка распределительная с обзорной крышкой","шт",12118]
["MBV 40.60.12","Коробка распределительная с обзорной крышкой","шт",14504]
["MC 03 I","Корпус распределительный 19\"","шт",3238]
["MC 1.80.10 H","Корпус силового соединителя 1250А","шт",{"$error":"#N/A"}]
["MC 1.100.10 H","Корпус силового соединителя 1600А","шт",{"$error":"#N/A"}]
["MC 2.100.10 H","Корпус силового соединителя 2000А","шт",{"$error":"#N/A"}]
["MC 3.100.10 H","Корпус силового соединителя 3150А","шт",{"$error":"#N/A"}]
["CS 3020.01","Краска для подкрашивания RAL3020, 400мл","шт",2460]
["CS 7035.01","Краска для подкрашивания RAL7035, 400мл","шт",2744]
["IBS 01.48.26 M","Крейт","шт",3058]
["IBS 01.48.36 M","Крейт","шт",4010]
["IBS 02.48.26 M","Крейт","шт",4010]
["IBS 02.48.36 M","Крейт","шт",4312]
["IBS 03.48.26 M","Крейт","шт",5040]
["IBS 03.48.36 M","Крейт","шт",5649]
["IBS 04.48.36 M","Крейт","шт",5602]
["S 5.35 MBS","Крепежный винт для коробок MBS, 4шт.","комп",320]
["IK 01 C","Кронштейн для соединения траверс, 2шт.","комп",1016]
["LL 10 H","Кронштейн для транспортировки КРУ, 4шт.","комп",{"$error":"#N/A"}]
["LL 12","Кронштейн для транспортировки, 2шт.","комп",1514]
["IK 01 CA","Кронштейн закладной для рамы WR, 4 шт.","комп",{"$error":"#N/A"}]
["OK 50 (PC)","Кронштейн крепления промышленного компьютера","шт",{"$error":"#N/A"}]
["OK 80 (PC)","Кронштейн крепления промышленного компьютера","шт",{"$error":"#N/A"}]
["MG 06 L v.2","Кронштейн рейки монтажной, 8 шт.","комп",{"$error":"#N/A"}]
["MG 09 L v.2","Кронштейн рейки монтажной, 8 шт.","комп",{"$error":"#N/A"}]
["MB 10.48 CLG","Кронштейн светильника","шт",829]
["MB 05.48 LA ","Кронштейн светильника светодиодного","шт",{"$error":"#N/A"}]
["IK 01 VA","Кронштейн угловой для рамы WR, 4 шт.","комп",{"$error":"#N/A"}]
["IK 02 EQ","Кронштейн угловой сейсмостойкий, 4 шт.","комп",1557]
["IK 01 FB","Кронштейн функционального блока FB, 4шт.","комп",3394]
["MG 01 BI v.2","Кронштейн шинодержателя BI, 2шт.","комп",1299]
["MG 02 BI v.2","Кронштейн шинодержателя BI, 2шт.","комп",1150]
["MG 03 BI","Кронштейн шинодержателя BI, 2шт.","комп",337]
["PC 1 L.S","Крышка замка защитная для пломбирования, 2шт","шт",1131]
["EP 01.10","Лента для защиты кромок, 10м","рул",10035]
["EP 01.50","Лента для защиты кромок, 50м","рул",40103]
["FI 02.230","Модуль вентиляторный","шт",12587]
["FI 03.230","Модуль вентиляторный","шт",15203]
["FI 04.230 D","Модуль вентиляторный","шт",23408]
["FI 06.230 D","Модуль вентиляторный","шт",30520]
["ZL 150 G","Монтажная стойка","шт",4906]
["ZL 350 V","Монтажная стойка","шт",5858]
["MB 04.03","Монтажный кронштейн, 4шт.","комп",403]
["LP 5DB.Z","Накладка двери цинковая","шт",1131]
["MCD 65.120.40 B","Нижняя часть пульта","шт",46690]
["MCD 65.120.50 B","Нижняя часть пульта","шт",53910]
["MCD 65.160.50 B","Нижняя часть пульта","шт",65209]
["MCS 65.60.40 B","Нижняя часть пульта","шт",30334]
["MCS 65.80.40 B","Нижняя часть пульта","шт",33393]
["MCS 65.80.50 B","Нижняя часть пульта","шт",38769]
["FT 37.60","Обзорное окно","шт",18099]
["FT 37.80","Обзорное окно","шт",19970]
["FT 67.60","Обзорное окно","шт",23722]
["FT 67.80","Обзорное окно","шт",28571]
["FT 37.60 S","Обзорное окно из нержавеющей стали","шт",42370]
["FT 67.60 S","Обзорное окно из нержавеющей стали","шт",56210]
["HT 15 D","Обогреватель","шт",3615]
["HT 150 D","Обогреватель","шт",8631]
["HT 250 FD","Обогреватель","шт",12212]
["HT 30 D","Обогреватель","шт",4130]
["HT 350 FD","Обогреватель","шт",13874]
["HT 45 D","Обогреватель","шт",4862]
["HT 80 D","Обогреватель","шт",7094]
["SD","Ограничитель дверной","шт",857]
["SD P","Ограничитель дверной быстроразъемный","комп",1602]
["SD 2 v2","Ограничитель дверной для компактных шкафов","шт",1051]
["SD 1","Ограничитель дверной для нижних частей","шт",958]
["WD 01","Опорное основание для кабельного канала, 20шт.","комп",1398]
["F 10.50","Опоры винтовые М10, 4шт.","комп",1472]
["F 12.40","Опоры винтовые М12, 4шт.","комп",2987]
["B 10 IC","Организатор кабельный, 10шт.","комп",5356]
["MB 10.48 IC","Панель 19\" с кабельными организаторами","шт",3466]
["MB 20.48 IE","Панель 19\" с петлями","шт",2001]
["MB 30.48 IE","Панель 19\" с петлями","шт",2095]
["MB 60.48 IE","Панель 19\" с петлями","шт",4592]
["MB 10.48 IK","Панель 19” с щеточным вводом для кабелей, 2шт.","комп",3296]
["MB 10.48 IK RAL9005","Панель 19” с щеточным вводом для кабелей, 2шт.","комп",4122]
["MB 10.48 I","Панель 19”, 2шт.","комп",958]
["MB 10.48 I RAL9005","Панель 19”, 2шт.","комп",1070]
["MB 15.48 I","Панель 19”, 2шт.","комп",1349]
["MB 20.48 I","Панель 19”, 2шт.","комп",1195]
["MB 30.48 I","Панель 19”, 2шт.","комп",1391]
["MB 30.48 I RAL9005","Панель 19”, 2шт.","комп",1553]
["MB 60.48 I","Панель 19”, 2шт.","комп",2266]
["MB 60.48 I RAL9005","Панель 19”, 2шт.","комп",2530]
["SP 10.60 FB","Панель боковая FB, 2шт.","комп",811]
["SP 10.80 FB","Панель боковая FB, 2шт.","комп",1021]
["SP 15.60 FB","Панель боковая FB, 2шт.","комп",1100]
["SP 15.80 FB","Панель боковая FB, 2шт.","комп",1416]
["SP 20.60 FB","Панель боковая FB, 2шт.","комп",1469]
["SP 20.80 FB","Панель боковая FB, 2шт.","комп",1916]
["SP 25.60 FB","Панель боковая FB, 2шт.","комп",1784]
["SP 25.80 FB","Панель боковая FB, 2шт.","комп",2338]
["SP 30.60 FB","Панель боковая FB, 2шт.","комп",2021]
["SP 30.80 FB","Панель боковая FB, 2шт.","комп",3073]
["SP 180.40 S","Панель боковая из нержавеющей стали, 2шт.","комп",40676]
["SP 180.50 S","Панель боковая из нержавеющей стали, 2шт.","комп",46047]
["SP 180.60 S","Панель боковая из нержавеющей стали, 2шт.","комп",61085]
["SP 200.60 S","Панель боковая из нержавеющей стали, 2шт.","комп",88181]
["SP 200.80 S","Панель боковая из нержавеющей стали, 2шт.","комп",83168]
["SP 220.60 S","Панель боковая из нержавеющей стали, 2шт.","комп",77370]
["Z 100.1000 IP","Панель боковая с вентиляцией цоколя телекоммуникационного","шт",1120]
["Z 100.600 IP","Панель боковая с вентиляцией цоколя телекоммуникационного","шт",878]
["Z 100.800 IP","Панель боковая с вентиляцией цоколя телекоммуникационного","шт",974]
["Z 100.1000 IK","Панель боковая с щеточным вводом для кабелей цоколя телекоммуникационного","шт",2419]
["Z 100.600 IK","Панель боковая с щеточным вводом для кабелей цоколя телекоммуникационного","шт",2101]
["Z 100.800 IK","Панель боковая с щеточным вводом для кабелей цоколя телекоммуникационного","шт",2496]
["Z 100.1000 I","Панель боковая цоколя телекоммуникационного","шт",1064]
["Z 100.600 I","Панель боковая цоколя телекоммуникационного","шт",762]
["Z 100.800 I","Панель боковая цоколя телекоммуникационного","шт",943]
["SP 120.100","Панель боковая, 2шт.","комп (2шт)",20671]
["SP 120.40","Панель боковая, 2шт.","комп (2шт)",10063]
["SP 120.50","Панель боковая, 2шт.","комп (2шт)",9736]
["SP 120.60","Панель боковая, 2шт.","комп (2шт)",14895]
["SP 120.60 RAL7004","Панель боковая, 2шт.","комп (2шт)",14280]
["SP 120.60 RAL9005","Панель боковая, 2шт.","комп (2шт)",14996]
["SP 120.80","Панель боковая, 2шт.","комп (2шт)",14804]
["SP 140.40","Панель боковая, 2шт.","комп (2шт)",8521]
["SP 140.40 RAL7004","Панель боковая, 2шт.","комп (2шт)",14350]
["SP 140.60","Панель боковая, 2шт.","комп (2шт)",13983]
["SP 160.40","Панель боковая, 2шт.","комп (2шт)",13604]
["SP 160.40 RAL7004","Панель боковая, 2шт.","комп (2шт)",14067]
["SP 160.50","Панель боковая, 2шт.","комп (2шт)",10237]
["SP 160.60","Панель боковая, 2шт.","комп (2шт)",14883]
["SP 160.60 RAL7004","Панель боковая, 2шт.","комп (2шт)",16408]
["SP 160.80","Панель боковая, 2шт.","комп (2шт)",20551]
["SP 180.100","Панель боковая, 2шт.","комп (2шт)",22601]
["SP 180.40","Панель боковая, 2шт.","комп (2шт)",12850]
["SP 180.40 F","Панель боковая, 2шт.","комп (2шт)",14538]
["SP 180.40 RAL3020","Панель боковая, 2шт.","комп (2шт)",12535]
["SP 180.40 RAL7004","Панель боковая, 2шт.","комп (2шт)",14258]
["SP 180.40 RAL9005","Панель боковая, 2шт.","комп (2шт)",14401]
["SP 180.50","Панель боковая, 2шт.","комп (2шт)",11433]
["SP 180.50 RAL7004","Панель боковая, 2шт.","комп (2шт)",12522]
["SP 180.60","Панель боковая, 2шт.","комп (2шт)",14566]
["SP 180.60 RAL3020","Панель боковая, 2шт.","комп (2шт)",16576]
["SP 180.60 RAL7004","Панель боковая, 2шт.","комп (2шт)",18734]
["SP 180.80","Панель боковая, 2шт.","комп (2шт)",22000]
["SP 200.100","Панель боковая, 2шт.","комп (2шт)",30464]
["SP 200.100 F","Панель боковая, 2шт.","комп (2шт)",30016]
["SP 200.120","Панель боковая, 2шт.","комп (2шт)",30855]
["SP 200.120 RAL9005","Панель боковая, 2шт.","комп (2шт)",36037]
["SP 200.40","Панель боковая, 2шт.","комп (2шт)",11288]
["SP 200.40 RAL3020","Панель боковая, 2шт.","комп (2шт)",12712]
["SP 200.40 RAL7004","Панель боковая, 2шт.","комп (2шт)",13014]
["SP 200.40 RAL9001","Панель боковая, 2шт.","комп (2шт)",14459]
["SP 200.40 RAL9005","Панель боковая, 2шт.","комп (2шт)",13988]
["SP 200.50","Панель боковая, 2шт.","комп (2шт)",15135]
["SP 200.50 F","Панель боковая, 2шт.","комп (2шт)",19250]
["SP 200.50 RAL3020","Панель боковая, 2шт.","комп (2шт)",16984]
["SP 200.50 RAL7038","Панель боковая, 2шт.","комп (2шт)",16511]
["SP 200.60","Панель боковая, 2шт.","комп (2шт)",15026]
["SP 200.60 F","Панель боковая, 2шт.","комп (2шт)",24954]
["SP 200.60 F RAL7004","Панель боковая, 2шт.","комп (2шт)",18939]
["SP 200.60 RAL3020","Панель боковая, 2шт.","комп (2шт)",17147]
["SP 200.60 RAL7004","Панель боковая, 2шт.","комп (2шт)",19316]
["SP 200.60 RAL7038","Панель боковая, 2шт.","комп (2шт)",18599]
["SP 200.60 RAL9001","Панель боковая, 2шт.","комп (2шт)",19462]
["SP 200.80","Панель боковая, 2шт.","комп (2шт)",18180]
["SP 200.80 F","Панель боковая, 2шт.","комп (2шт)",22344]
["SP 200.80 RAL7004","Панель боковая, 2шт.","комп (2шт)",23213]
["SP 200.80 RAL7038","Панель боковая, 2шт.","комп (2шт)",22734]
["SP 200.80 RAL9005","Панель боковая, 2шт.","комп (2шт)",22734]
["SP 220.100","Панель боковая, 2шт.","комп (2шт)",29098]
["SP 220.120","Панель боковая, 2шт.","комп (2шт)",35805]
["SP 220.40","Панель боковая, 2шт.","комп (2шт)",11373]
["SP 220.60","Панель боковая, 2шт.","комп (2шт)",15749]
["SP 220.60 F","Панель боковая, 2шт.","комп (2шт)",18768]
["SP 220.60 F RAL7004","Панель боковая, 2шт.","комп (2шт)",21020]
["SP 220.60 RAL3020","Панель боковая, 2шт.","комп (2шт)",19694]
["SP 220.60 RAL7004","Панель боковая, 2шт.","комп (2шт)",17125]
["SP 220.60 RAL9005","Панель боковая, 2шт.","комп (2шт)",19694]
["SP 220.80","Панель боковая, 2шт.","комп (2шт)",20569]
["SP 220.80 F","Панель боковая, 2шт.","комп (2шт)",26990]
["SP 220.80 F RAL7004","Панель боковая, 2шт.","комп (2шт)",22859]
["SP 220.80 RAL7004","Панель боковая, 2шт.","комп (2шт)",21515]
["FC 02.230","Панель вентиляторная","шт",12995]
["FC 02.230 D","Панель вентиляторная","шт",15254]
["FC 02.230 P","Панель вентиляторная","шт",14029]
["FC 02.230 PD","Панель вентиляторная","шт",17500]
["FC 04.230 D","Панель вентиляторная","шт",21790]
["RV 38.38","Панель вентиляторная","шт",8024]
["FC 60.20","Панель вентиляторная концевая","шт",638]
["FC 80.20","Панель вентиляторная концевая","шт",851]
["PV 38.21 I","Панель вентиляционная","шт",1580]
["PV 38.38 I","Панель вентиляционная","шт",2310]
["RV 38.38 L","Панель вентиляционная потолочная","шт",7515]
["PV 38.21 IF","Панель вентиляционная с фильтром","шт",2700]
["PV 38.38 IF","Панель вентиляционная с фильтром","шт",5208]
["PV 60.100 PK","Панель вентиляционная с фильтром и щеточным вводом для кабелей","шт",7347]
["PV 60.60 PK","Панель вентиляционная с фильтром и щеточным вводом для кабелей","шт",5197]
["PV 60.80 PK","Панель вентиляционная с фильтром и щеточным вводом для кабелей","шт",5734]
["PV 80.100 PK","Панель вентиляционная с фильтром и щеточным вводом для кабелей","шт",10438]
["PV 80.60 PK","Панель вентиляционная с фильтром и щеточным вводом для кабелей","шт",6541]
["PV 80.80 PK","Панель вентиляционная с фильтром и щеточным вводом для кабелей","шт",8646]
["PV 12.20","Панель жалюзийная вентиляционная","шт",448]
["PV 22.20","Панель жалюзийная вентиляционная","шт",649]
["PV 12.20 S","Панель жалюзийная вентиляционная из нержавеющей стали","шт",2043]
["PV 22.20 S","Панель жалюзийная вентиляционная из нержавеющей стали","шт",3804]
["BP 120.60","Панель задняя","шт",11194]
["BP 120.60 RAL7004","Панель задняя","шт",11454]
["BP 120.60 RAL9005","Панель задняя","шт",11498]
["BP 120.80","Панель задняя","шт",11340]
["BP 140.60","Панель задняя","шт",8711]
["BP 140.60 RAL7004","Панель задняя","шт",17470]
["BP 160.40","Панель задняя","шт",8344]
["BP 160.60","Панель задняя","шт",15467]
["BP 160.60 RAL7004","Панель задняя","шт",15880]
["BP 160.80","Панель задняя","шт",17210]
["BP 180.100","Панель задняя","шт",17625]
["BP 180.100 RAL7004","Панель задняя","шт",18267]
["BP 180.120","Панель задняя","шт",17654]
["BP 180.40","Панель задняя","шт",8729]
["BP 180.40 RAL7004","Панель задняя","шт",10371]
["BP 180.60","Панель задняя","шт",10488]
["BP 180.60 RAL3020","Панель задняя","шт",13989]
["BP 180.60 RAL7004","Панель задняя","шт",13919]
["BP 180.80","Панель задняя","шт",15066]
["BP 180.80 RAL3020","Панель задняя","шт",15467]
["BP 180.80 RAL7004","Панель задняя","шт",15646]
["BP 180.80 RAL9005","Панель задняя","шт",16989]
["BP 200.100","Панель задняя","шт",19772]
["BP 200.100 RAL3020","Панель задняя","шт",20250]
["BP 200.100 RAL7004","Панель задняя","шт",22757]
["BP 200.120","Панель задняя","шт",17894]
["BP 200.120 RAL3020       ","Панель задняя","шт",21213]
["BP 200.120 RAL7004","Панель задняя","шт",23064]
["BP 200.120 RAL9005","Панель задняя","шт",22708]
["BP 200.40","Панель задняя","шт",11354]
["BP 200.40 RAL7004","Панель задняя","шт",12684]
["BP 200.60","Панель задняя","шт",10789]
["BP 200.60 RAL3020","Панель задняя","шт",13872]
["BP 200.60 RAL7004","Панель задняя","шт",14312]
["BP 200.60 RAL9001","Панель задняя","шт",14390]
["BP 200.80","Панель задняя","шт",15317]
["BP 200.80 RAL3020","Панель задняя","шт",15747]
["BP 200.80 RAL7004","Панель задняя","шт",17543]
["BP 200.80 RAL9001","Панель задняя","шт",17645]
["BP 200.80 RAL9005","Панель задняя","шт",17273]
["BP 220.100","Панель задняя","шт",20552]
["BP 220.100 RAL7004","Панель задняя","шт",23333]
["BP 220.120","Панель задняя","шт",18344]
["BP 220.120 RAL7004","Панель задняя","шт",20653]
["BP 220.120 RAL9005","Панель задняя","шт",22940]
["BP 220.40","Панель задняя","шт",13270]
["BP 220.60","Панель задняя","шт",12907]
["BP 220.60 RAL7004","Панель задняя","шт",14459]
["BP 220.80","Панель задняя","шт",15443]
["BP 220.80 RAL7004","Панель задняя","шт",15714]
["BP 220.80 RAL9005","Панель задняя","шт",17414]
["BP 180.80 FM","Панель задняя скрытого монтажа","шт",{"$error":"#N/A"}]
["MB 15.50.1 H","Панель защитная для секционирования MB H","шт",1238]
["MB 15.50.1 HC","Панель защитная для секционирования MB H","шт",1366]
["MB 20.50.1 HC","Панель защитная для секционирования MB H","шт",1467]
["MB 25.50.1 HC","Панель защитная для секционирования MB H","шт",1714]
["MB 30.50.1 VC","Панель защитная для секционирования MB V","шт",2766]
["MB 40.50.1 VC","Панель защитная для секционирования MB V","шт",2808]
["MB 45.50.1 VC","Панель защитная для секционирования MB V","шт",3172]
["MB 60.50.1 VC","Панель защитная для секционирования MB V","шт",3349]
["MB 60.70.1 VC","Панель защитная для секционирования MB V","шт",4250]
["PK 100.40 GP","Панель кабельного ввода глухая","комп",3102]
["PK 100.60 GP","Панель кабельного ввода глухая","комп",4133]
["PK 100.80 GP","Панель кабельного ввода глухая","комп",5590]
["PK 120.40 GP","Панель кабельного ввода глухая","комп",3600]
["PK 120.60 GP","Панель кабельного ввода глухая","комп",5320]
["PK 120.80 GP","Панель кабельного ввода глухая","комп",6541]
["PK 60.40 GP","Панель кабельного ввода глухая","комп",2210]
["PK 60.40 GP RAL7004","Панель кабельного ввода глухая","комп",2540]
["PK 60.60 GP","Панель кабельного ввода глухая","комп",3210]
["PK 60.60 GP RAL7004","Панель кабельного ввода глухая","комп",4640]
["PK 60.60 GP RAL9005","Панель кабельного ввода глухая","комп",3692]
["PK 80.40 GP","Панель кабельного ввода глухая","комп",2486]
["PK 80.50 GP","Панель кабельного ввода глухая","комп",2969]
["PK 80.60 GP","Панель кабельного ввода глухая","комп",4738]
["PK 80.60 GP RAL7004","Панель кабельного ввода глухая","комп",3864]
["PK 80.80 GP","Панель кабельного ввода глухая","комп",4988]
["PK 15.13 G","Панель кабельного ввода глухая для компактных шкафов","шт",325]
["PK 25.13 G","Панель кабельного ввода глухая для компактных шкафов","шт",530]
["PK 35.13 G","Панель кабельного ввода глухая для компактных шкафов","шт",728]
["PK 45.13 G","Панель кабельного ввода глухая для компактных шкафов","шт",762]
["PK 55.13 G","Панель кабельного ввода глухая для компактных шкафов","шт",892]
["PK 55.13 G RAL7004","Панель кабельного ввода глухая для компактных шкафов","шт",910]
["PK 60.50 GPS","Панель кабельного ввода глухая из нержавеющей стали","комп",17660]
["PK 60.60 GPS","Панель кабельного ввода глухая из нержавеющей стали","комп",9434]
["PK 80.50 GPS","Панель кабельного ввода глухая из нержавеющей стали","комп",18900]
["PK 80.60 GPS","Панель кабельного ввода глухая из нержавеющей стали","комп",20620]
["PKV 40 P","Панель кабельного ввода подвижная ","шт",280]
["PKV 50 P","Панель кабельного ввода подвижная ","шт",363]
["PKV 60 P","Панель кабельного ввода подвижная ","шт",397]
["PKV 80 P","Панель кабельного ввода подвижная ","шт",515]
["PKV 40 PH","Панель кабельного ввода подвижная увеличенная","шт",392]
["PKV 60 PH","Панель кабельного ввода подвижная увеличенная","шт",986]
["PKV 80 PH","Панель кабельного ввода подвижная увеличенная","шт",1187]
["PK 15.13","Панель кабельного ввода с выбивными отверстиями","шт",550]
["PK 25.13","Панель кабельного ввода с выбивными отверстиями","шт",742]
["PK 35.13","Панель кабельного ввода с выбивными отверстиями","шт",999]
["PK 35.13 RAL7004","Панель кабельного ввода с выбивными отверстиями","шт",1020]
["PK 45.13","Панель кабельного ввода с выбивными отверстиями","шт",1198]
["PK 55.13","Панель кабельного ввода с выбивными отверстиями","шт",1288]
["PKV 40 S","Панель кабельного ввода стационарная","шт",280]
["PKV 50 S","Панель кабельного ввода стационарная","шт",350]
["PKV 60 S","Панель кабельного ввода стационарная","шт",459]
["PKV 80 S","Панель кабельного ввода стационарная","шт",507]
["PKV 40 SH","Панель кабельного ввода стационарная увеличенная","шт",392]
["PKV 60 SH","Панель кабельного ввода стационарная увеличенная","шт",862]
["PKV 80 SH","Панель кабельного ввода стационарная увеличенная","шт",1176]
["PKV 80 B","Панель кабельного ввода узкая","шт",448]
["PK 32.08 P","Панель кабельного ввода, 2шт.","комп",1741]
["PK 42.08 P","Панель кабельного ввода, 2шт.","комп",2079]
["PK 62.08 P","Панель кабельного ввода, 2шт.","комп",2530]
["DP 10.60","Панель концевая","шт",2101]
["DP 10.60 RAL7004","Панель концевая","шт",2346]
["DP 10.80","Панель концевая","шт",2225]
["R 100.40 C","Панель концевая нижней части","шт",6083]
["R 120.40 C","Панель концевая нижней части","шт",7249]
["R 120.50 C","Панель концевая нижней части","шт",7612]
["R 160.40 C","Панель концевая нижней части","шт",10340]
["R 160.50 C","Панель концевая нижней части","шт",9273]
["R 60.40 C","Панель концевая нижней части","шт",4450]
["R 80.40 C","Панель концевая нижней части","шт",5191]
["R 80.50 C","Панель концевая нижней части","шт",5940]
["R 80.40 CS","Панель концевая нижней части из нержавеющей стали","шт",33962]
["R 120.24 C","Панель концевая средней части","шт",4805]
["R 160.24 C","Панель концевая средней части","шт",5072]
["R 80.24 C","Панель концевая средней части","шт",4144]
["MB 15.35","Панель модульная глухая для компактных шкафов","шт",700]
["MB 15.55","Панель модульная глухая для компактных шкафов","шт",784]
["MB 15.75","Панель модульная глухая для компактных шкафов","шт",773]
["MB 20.35","Панель модульная глухая для компактных шкафов","шт",538]
["MB 20.55","Панель модульная глухая для компактных шкафов","шт",890]
["MB 20.75","Панель модульная глухая для компактных шкафов","шт",884]
["MB 25.35","Панель модульная глухая для компактных шкафов","шт",810]
["MB 25.55","Панель модульная глухая для компактных шкафов","шт",920]
["MB 25.75","Панель модульная глухая для компактных шкафов","шт",1037]
["MB 05.30","Панель модульная глухая для шкафов MPx","шт",401]
["MB 05.50","Панель модульная глухая для шкафов MPx","шт",372]
["MB 05.70","Панель модульная глухая для шкафов MPx","шт",433]
["MB 05.90","Панель модульная глухая для шкафов MPx","шт",694]
["MB 10.70","Панель модульная глухая для шкафов MPx","шт",728]
["MB 15.30","Панель модульная глухая для шкафов MPx","шт",564]
["MB 15.50","Панель модульная глухая для шкафов MPx","шт",620]
["MB 15.70","Панель модульная глухая для шкафов MPx","шт",773]
["MB 15.70 RAL9005","Панель модульная глухая для шкафов MPx","шт",967]
["MB 20.30","Панель модульная глухая для шкафов MPx","шт",626]
["MB 20.50","Панель модульная глухая для шкафов MPx","шт",705]
["MB 20.70","Панель модульная глухая для шкафов MPx","шт",1463]
["MB 20.90","Панель модульная глухая для шкафов MPx","шт",1400]
["MB 30.30","Панель модульная глухая для шкафов MPx","шт",850]
["MB 30.50","Панель модульная глухая для шкафов MPx","шт",1040]
["MB 30.70","Панель модульная глухая для шкафов MPx","шт",1349]
["MB 30.90","Панель модульная глухая для шкафов MPx","шт",2040]
["MB 40.30","Панель модульная глухая для шкафов MPx","шт",1040]
["MB 40.50","Панель модульная глухая для шкафов MPx","шт",1226]
["MB 40.70","Панель модульная глухая для шкафов MPx","шт",1524]
["MB 45.30","Панель модульная глухая для шкафов MPx","шт",1109]
["MB 45.50","Панель модульная глухая для шкафов MPx","шт",1590]
["MB 45.70","Панель модульная глухая для шкафов MPx","шт",1886]
["MB 45.90","Панель модульная глухая для шкафов MPx","шт",3262]
["MB 50.70","Панель модульная глухая для шкафов MPx","шт",2367]
["MB 60.110","Панель модульная глухая для шкафов MPx","шт",4327]
["MB 60.30","Панель модульная глухая для шкафов MPx","шт",1379]
["MB 60.50","Панель модульная глухая для шкафов MPx","шт",1700]
["MB 60.70","Панель модульная глухая для шкафов MPx","шт",2029]
["MB 60.90","Панель модульная глухая для шкафов MPx","шт",4243]
["MB 20.100","Панель модульная глухая с доработкой","шт",{"$error":"#N/A"}]
["MB 20.60","Панель модульная глухая с доработкой","шт",{"$error":"#N/A"}]
["MB 20.80","Панель модульная глухая с доработкой","шт",{"$error":"#N/A"}]
["MB 15.30 P","Панель модульная с вырезом для шкафов MPx","шт",564]
["MB 15.50 P","Панель модульная с вырезом для шкафов MPx","шт",649]
["MB 15.70 P","Панель модульная с вырезом для шкафов MPx","шт",829]
["MB 20.30 P","Панель модульная с вырезом для шкафов MPx","шт",626]
["MB 20.50 P","Панель модульная с вырезом для шкафов MPx","шт",705]
["MB 20.70 P","Панель модульная с вырезом для шкафов MPx","шт",886]
["MB 30.30 P","Панель модульная с вырезом для шкафов MPx","шт",850]
["MB 30.50 P","Панель модульная с вырезом для шкафов MPx","шт",1008]
["MB 30.70 P","Панель модульная с вырезом для шкафов MPx","шт",1329]
["MB 40.50 P","Панель модульная с вырезом для шкафов MPx","шт",1342]
["MB 40.70 P","Панель модульная с вырезом для шкафов MPx","шт",1661]
["MB 45.30 P","Панель модульная с вырезом для шкафов MPx","шт",1109]
["MB 45.50 P","Панель модульная с вырезом для шкафов MPx","шт",1523]
["MB 45.70 P","Панель модульная с вырезом для шкафов MPx","шт",1904]
["MB 60.30 P","Панель модульная с вырезом для шкафов MPx","шт",1379]
["MB 60.50 P","Панель модульная с вырезом для шкафов MPx","шт",1859]
["MB 60.70 P","Панель модульная с вырезом для шкафов MPx","шт",2156]
["MB 60.70 F","Панель модульная с перфорацией для шкафов MPx","шт",1893]
["MP 100.100","Панель монтажная для компактных шкафов","шт",9520]
["MP 100.60","Панель монтажная для компактных шкафов","шт",4846]
["MP 100.80","Панель монтажная для компактных шкафов","шт",6590]
["MP 120.100 E","Панель монтажная для компактных шкафов","шт",9498]
["MP 120.120 E","Панель монтажная для компактных шкафов","шт",17381]
["MP 120.60 E","Панель монтажная для компактных шкафов","шт",4854]
["MP 120.80 E","Панель монтажная для компактных шкафов","шт",7878]
["MP 140.100 E","Панель монтажная для компактных шкафов","шт",17398]
["MP 140.60 E","Панель монтажная для компактных шкафов","шт",8757]
["MP 140.80 E","Панель монтажная для компактных шкафов","шт",14864]
["MP 160.60 E","Панель монтажная для компактных шкафов","шт",10237]
["MP 180.60 E","Панель монтажная для компактных шкафов","шт",11731]
["MP 30.20","Панель монтажная для компактных шкафов","шт",649]
["MP 30.30","Панель монтажная для компактных шкафов","шт",737]
["MP 30.40","Панель монтажная для компактных шкафов","шт",828]
["MP 40.30","Панель монтажная для компактных шкафов","шт",825]
["MP 40.40","Панель монтажная для компактных шкафов","шт",1116]
["MP 40.60","Панель монтажная для компактных шкафов","шт",1680]
["MP 50.30","Панель монтажная для компактных шкафов","шт",1070]
["MP 50.40","Панель монтажная для компактных шкафов","шт",1536]
["MP 50.50","Панель монтажная для компактных шкафов","шт",2256]
["MP 60.40","Панель монтажная для компактных шкафов","шт",1599]
["MP 60.50","Панель монтажная для компактных шкафов","шт",2171]
["MP 60.60","Панель монтажная для компактных шкафов","шт",2346]
["MP 70.50","Панель монтажная для компактных шкафов","шт",2358]
["MP 80.100","Панель монтажная для компактных шкафов","шт",7426]
["MP 80.120","Панель монтажная для компактных шкафов","шт",9498]
["MP 80.60","Панель монтажная для компактных шкафов","шт",3529]
["MP 80.80","Панель монтажная для компактных шкафов","шт",6291]
["MP 15.15 B","Панель монтажная для коробок MBS","шт",235]
["MP 15.20 B","Панель монтажная для коробок MBS","шт",319]
["MP 20.20 B","Панель монтажная для коробок MBS","шт",426]
["MP 20.30 B","Панель монтажная для коробок MBS","шт",564]
["MP 20.40 B","Панель монтажная для коробок MBS","шт",616]
["MP 40.40 B","Панель монтажная для коробок MBS","шт",1030]
["MP 15.50 H1","Панель монтажная для секционирования MP H","шт",1435]
["MP 15.50 H1C","Панель монтажная для секционирования MP H","шт",1434]
["MP 20.50 H1C","Панель монтажная для секционирования MP H","шт",1298]
["MP 25.50 H1C","Панель монтажная для секционирования MP H","шт",1596]
["MP 25.50 V1C","Панель монтажная для секционирования MP V","шт",1596]
["MP 30.50 V1C","Панель монтажная для секционирования MP V","шт",2056]
["MP 35.50 V1C","Панель монтажная для секционирования MP V","шт",3020]
["MP NA8 I","Панель монтажная для секционирования NA8","шт",2974]
["MP NA8 II","Панель монтажная для секционирования NA8","шт",4327]
["MP 120.60","Панель монтажная для шкафов MPx","шт",10669]
["MP 120.80","Панель монтажная для шкафов MPx","шт",16163]
["MP 140.60","Панель монтажная для шкафов MPx","шт",9885]
["MP 160.60","Панель монтажная для шкафов MPx","шт",10568]
["MP 160.80","Панель монтажная для шкафов MPx","шт",12314]
["MP 180.100","Панель монтажная для шкафов MPx","шт",19581]
["MP 180.120","Панель монтажная для шкафов MPx","шт",22299]
["MP 180.40","Панель монтажная для шкафов MPx","шт",8949]
["MP 180.60","Панель монтажная для шкафов MPx","шт",10182]
["MP 180.80","Панель монтажная для шкафов MPx","шт",12338]
["MP 200.100","Панель монтажная для шкафов MPx","шт",20181]
["MP 200.120","Панель монтажная для шкафов MPx","шт",21187]
["MP 200.40","Панель монтажная для шкафов MPx","шт",11171]
["MP 200.60","Панель монтажная для шкафов MPx","шт",10681]
["MP 200.80","Панель монтажная для шкафов MPx","шт",12785]
["MP 220.100","Панель монтажная для шкафов MPx","шт",21301]
["MP 220.120","Панель монтажная для шкафов MPx","шт",23433]
["MP 220.60","Панель монтажная для шкафов MPx","шт",11145]
["MP 220.80","Панель монтажная для шкафов MPx","шт",20258]
["MP 100.60 P","Панель монтажная микроперфорированная для компактных шкафов","шт",4846]
["MP 100.80 P","Панель монтажная микроперфорированная для компактных шкафов","шт",6302]
["MP 120.100 PE","Панель монтажная микроперфорированная для компактных шкафов","шт",11010]
["MP 120.60 PE","Панель монтажная микроперфорированная для компактных шкафов","шт",5003]
["MP 120.80 PE","Панель монтажная микроперфорированная для компактных шкафов","шт",7426]
["MP 140.100 PE","Панель монтажная микроперфорированная для компактных шкафов","шт",17398]
["MP 140.60 PE","Панель монтажная микроперфорированная для компактных шкафов","шт",8756]
["MP 140.80 PE","Панель монтажная микроперфорированная для компактных шкафов","шт",14437]
["MP 160.60 PE","Панель монтажная микроперфорированная для компактных шкафов","шт",10584]
["MP 30.20 P","Панель монтажная микроперфорированная для компактных шкафов","шт",640]
["MP 30.30 P","Панель монтажная микроперфорированная для компактных шкафов","шт",860]
["MP 30.40 P","Панель монтажная микроперфорированная для компактных шкафов","шт",1010]
["MP 40.30 P","Панель монтажная микроперфорированная для компактных шкафов","шт",1010]
["MP 40.40 P","Панель монтажная микроперфорированная для компактных шкафов","шт",1255]
["MP 50.30 P","Панель монтажная микроперфорированная для компактных шкафов","шт",1141]
["MP 50.40 P","Панель монтажная микроперфорированная для компактных шкафов","шт",1536]
["MP 50.50 P","Панель монтажная микроперфорированная для компактных шкафов","шт",2256]
["MP 60.40 P","Панель монтажная микроперфорированная для компактных шкафов","шт",1714]
["MP 60.60 P","Панель монтажная микроперфорированная для компактных шкафов","шт",2520]
["MP 70.50 P","Панель монтажная микроперфорированная для компактных шкафов","шт",2530]
["MP 80.100 P","Панель монтажная микроперфорированная для компактных шкафов","шт",6966]
["MP 80.60 P","Панель монтажная микроперфорированная для компактных шкафов","шт",3529]
["MP 80.80 P","Панель монтажная микроперфорированная для компактных шкафов","шт",6126]
["MP 180.100 P","Панель монтажная микроперфорированная для шкафов MPx","шт",23677]
["MP 180.120 P","Панель монтажная микроперфорированная для шкафов MPx","шт",25581]
["MP 180.60 P","Панель монтажная микроперфорированная для шкафов MPx","шт",13168]
["MP 180.80 P","Панель монтажная микроперфорированная для шкафов MPx","шт",13642]
["MP 200.100 P","Панель монтажная микроперфорированная для шкафов MPx","шт",23688]
["MP 200.120 P","Панель монтажная микроперфорированная для шкафов MPx","шт",23934]
["MP 200.60 P","Панель монтажная микроперфорированная для шкафов MPx","шт",13630]
["MP 200.80 P","Панель монтажная микроперфорированная для шкафов MPx","шт",16164]
["MP 220.120 P","Панель монтажная микроперфорированная для шкафов MPx","шт",23035]
["MP 220.60 P","Панель монтажная микроперфорированная для шкафов MPx","шт",11200]
["MP 220.80 P","Панель монтажная микроперфорированная для шкафов MPx","шт",21280]
["MP 06.10 P","Панель монтажная плоская, 8шт.","комп",2805]
["MP 10.10 P","Панель монтажная плоская, 8шт.","комп",2778]
["MP 160.11","Панель монтажная промежуточная","шт",3979]
["MP 180.11","Панель монтажная промежуточная","шт",3090]
["MP 200.11","Панель монтажная промежуточная","шт",3368]
["MP 220.11","Панель монтажная промежуточная","шт",3389]
["MP 105.35 M","Панель монтажная секционная","шт",5047]
["MP 105.45 M","Панель монтажная секционная","шт",5964]
["MP 45.15 M","Панель монтажная секционная","шт",2330]
["MP 45.25 M","Панель монтажная секционная","шт",3038]
["MP 45.35 M","Панель монтажная секционная","шт",3130]
["MP 45.55 M","Панель монтажная секционная","шт",3735]
["MP 65.110 M","Панель монтажная секционная","шт",7747]
["MP 65.15 M","Панель монтажная секционная","шт",2490]
["MP 65.25 M","Панель монтажная секционная","шт",3564]
["MP 65.35 M","Панель монтажная секционная","шт",3952]
["MP 65.45 M","Панель монтажная секционная","шт",3780]
["MP 65.55 M","Панель монтажная секционная","шт",4151]
["MP 85.160 M","Панель монтажная секционная","шт",31046]
["MP 85.35 M","Панель монтажная секционная","шт",3996]
["MP 85.45 M","Панель монтажная секционная","шт",5140]
["MP 45.25 MP","Панель монтажная секционная с перфорацией","шт",2657]
["MP 45.35 MP","Панель монтажная секционная с перфорацией","шт",3001]
["MP 45.55 MP","Панель монтажная секционная с перфорацией","шт",3519]
["MP 65.35 MP","Панель монтажная секционная с перфорацией","шт",4637]
["MP 65.45 MP","Панель монтажная секционная с перфорацией","шт",5578]
["MP 65.55 MP","Панель монтажная секционная с перфорацией","шт",4376]
["MP 03.10 PL","Панель монтажная угловая, 8шт.","комп",3573]
["MP 06.10 PL","Панель монтажная угловая, 8шт.","комп",2992]
["PV 38.21 IS","Панель основания глухая для шкафов IPx","шт",1439]
["PV 38.38 IS","Панель основания глухая для шкафов IPx","шт",1520]
["R 60.100 P","Панель потолочная с перфорацией","шт",7979]
["R 60.60 P","Панель потолочная с перфорацией","шт",7347]
["R 60.80 P","Панель потолочная с перфорацией","шт",7797]
["R 80.100 P","Панель потолочная с перфорацией","шт",10805]
["R 80.120 P","Панель потолочная с перфорацией","шт",16190]
["R 80.120 P RAL9005","Панель потолочная с перфорацией","шт",18620]
["R 80.60 P","Панель потолочная с перфорацией","шт",8062]
["R 80.80 P","Панель потолочная с перфорацией","шт",9296]
["R 60.100 PK","Панель потолочная с перфорацией и вводом для кабелей","шт",9486]
["R 60.40 PK","Панель потолочная с перфорацией и вводом для кабелей","шт",7023]
["R 60.60 PK","Панель потолочная с перфорацией и вводом для кабелей","шт",8755]
["R 60.80 PK","Панель потолочная с перфорацией и вводом для кабелей","шт",9425]
["R 80.100 PK","Панель потолочная с перфорацией и вводом для кабелей","шт",14358]
["R 80.60 PK","Панель потолочная с перфорацией и вводом для кабелей","шт",11454]
["R 80.80 PK","Панель потолочная с перфорацией и вводом для кабелей","шт",11701]
["SP 180.40 N","Панель разделительная","шт",4983]
["SP 180.50 N","Панель разделительная","шт",6205]
["SP 180.60 N","Панель разделительная","шт",6850]
["SP 200.40 N","Панель разделительная","шт",6087]
["SP 200.50 N","Панель разделительная","шт",6574]
["SP 200.60 N","Панель разделительная","шт",7457]
["SP 200.80 N","Панель разделительная","шт",7797]
["SP 220.60 N","Панель разделительная","шт",7821]
["SP 220.80 N","Панель разделительная","шт",7416]
["PVD 15.28 FB","Панель разделительная вертикальная PVD","шт",364]
["PVD 20.28 FB","Панель разделительная вертикальная PVD","шт",416]
["PVD 25.28 FB","Панель разделительная вертикальная PVD","шт",522]
["PVW 15.28 FB","Панель разделительная вертикальная PVW","шт",430]
["PVW 20.28 FB","Панель разделительная вертикальная PVW","шт",522]
["PVW 25.28 FB","Панель разделительная вертикальная PVW","шт",627]
["PHW 60.15 FB","Панель разделительная горизонтальная PHW","шт",706]
["PV 38.21 IK","Панель с щеточным вводом для кабелей","шт",2524]
["PV 38.38 IK","Панель с щеточным вводом для кабелей","шт",3100]
["DP 100.60","Панель секционная","шт",7078]
["DP 100.80","Панель секционная","шт",8243]
["DP 20.60","Панель секционная","шт",3315]
["DP 20.80","Панель секционная","шт",3550]
["DP 40.60","Панель секционная","шт",4133]
["DP 40.80","Панель секционная","шт",4211]
["DP 60.60","Панель секционная","шт",4439]
["DP 60.80","Панель секционная","шт",4950]
["DP 80.60","Панель секционная","шт",6505]
["DP 80.80","Панель секционная","шт",6877]
["SP 120.60 IP v.2","Панель телекоммуникационная боковая с перфорацией, 2шт.","комп",34100]
["SP 180.80 IP v.2","Панель телекоммуникационная боковая с перфорацией, 2шт.","комп",86130]
["SP 200.60 IP v.2","Панель телекоммуникационная боковая с перфорацией, 2шт.","комп",44163]
["SP 120.100 I","Панель телекоммуникационная боковая, 2шт.","комп",19589]
["SP 120.60 I","Панель телекоммуникационная боковая, 2шт.","комп",15826]
["SP 120.80 I","Панель телекоммуникационная боковая, 2шт.","комп",21246]
["SP 180.100 I","Панель телекоммуникационная боковая, 2шт.","комп",31556]
["SP 180.60 I","Панель телекоммуникационная боковая, 2шт.","комп",20845]
["SP 180.80 I","Панель телекоммуникационная боковая, 2шт.","комп",28045]
["SP 200.100 I","Панель телекоммуникационная боковая, 2шт.","комп",35056]
["SP 200.60 I","Панель телекоммуникационная боковая, 2шт.","комп",18402]
["SP 200.80 I","Панель телекоммуникационная боковая, 2шт.","комп",30983]
["SP 220.100 I","Панель телекоммуникационная боковая, 2шт.","комп",34406]
["SP 220.60 I","Панель телекоммуникационная боковая, 2шт.","комп",21258]
["SP 220.80 I","Панель телекоммуникационная боковая, 2шт.","комп",28437]
["R 60.100 I","Панель телекоммуникационная потолочная","шт",4883]
["R 60.60 I","Панель телекоммуникационная потолочная","шт",3886]
["R 60.80 I","Панель телекоммуникационная потолочная","шт",4827]
["R 80.100 I","Панель телекоммуникационная потолочная","шт",7176]
["R 80.60 I","Панель телекоммуникационная потолочная","шт",4715]
["R 80.80 I","Панель телекоммуникационная потолочная","шт",6877]
["R 60.100 IP v.2","Панель телекоммуникационная потолочная с перфорацией","шт",17400]
["R 60.60 IP v.2","Панель телекоммуникационная потолочная с перфорацией","шт",10770]
["R 60.80 IP v.2","Панель телекоммуникационная потолочная с перфорацией","шт",20574]
["R 80.100 IP v.2","Панель телекоммуникационная потолочная с перфорацией","шт",15250]
["R 80.60 IP v.2","Панель телекоммуникационная потолочная с перфорацией","шт",14060]
["R 80.80 IP v.2","Панель телекоммуникационная потолочная с перфорацией","шт",18480]
["R 60.100 IK","Панель телекоммуникационная потолочная с щеточным вводом для кабелей","шт",6328]
["R 60.60 IK","Панель телекоммуникационная потолочная с щеточным вводом для кабелей","шт",4794]
["R 60.80 IK","Панель телекоммуникационная потолочная с щеточным вводом для кабелей","шт",5634]
["R 80.100 IK","Панель телекоммуникационная потолочная с щеточным вводом для кабелей","шт",9542]
["R 80.60 IK","Панель телекоммуникационная потолочная с щеточным вводом для кабелей","шт",7538]
["R 80.80 IK","Панель телекоммуникационная потолочная с щеточным вводом для кабелей","шт",9695]
["MES 30.30.15 U","Панель управления","шт",12968]
["MES 30.40.15 U","Панель управления","шт",15368]
["MES 40.60.21 U","Панель управления","шт",15658]
["MES 50.50.21 U","Панель управления","шт",16851]
["SES 30.40.15 U","Панель управления из нержавеющей стали","шт",39579]
["SES 40.60.21 U","Панель управления из нержавеющей стали","шт",47916]
["ZA 00.50 v2 (Д264)","Панель цоколя c доработкой","шт",{"$error":"#N/A"}]
["ZA 100.00 H v.2","Передние и задние элементы цоколя","комп",8752]
["ZA 100.00 v.2","Передние и задние элементы цоколя","комп",7105]
["ZA 120.00 H v.2","Передние и задние элементы цоколя","комп",9425]
["ZA 120.00 v.2","Передние и задние элементы цоколя","комп",7596]
["ZA 160.00 v.2","Передние и задние элементы цоколя","комп",7935]
["ZA 40.00 H v.2","Передние и задние элементы цоколя","комп",6944]
["ZA 40.00 v.2","Передние и задние элементы цоколя","комп",5837]
["ZA 60.00 H v.2","Передние и задние элементы цоколя","комп",7640]
["ZA 60.00 H v.2 RAL7022","Передние и задние элементы цоколя","комп",9480]
["ZA 60.00 v.2","Передние и задние элементы цоколя","комп",6271]
["ZA 80.00 H v.2","Передние и задние элементы цоколя","комп",8384]
["ZA 80.00 H v.2 RAL7022","Передние и задние элементы цоколя","комп",10024]
["ZA 80.00 v.2","Передние и задние элементы цоколя","комп",6694]
["ZA 80.00 v.2 RAL7022","Передние и задние элементы цоколя","комп",7314]
["ZA 100.00 HS v.2","Передние и задние элементы цоколя из нержавеющей стали","комп",28549]
["ZA 100.00 S v.2","Передние и задние элементы цоколя из нержавеющей стали","комп",25250]
["ZA 120.00 HS v.2","Передние и задние элементы цоколя из нержавеющей стали","комп",30455]
["ZA 120.00 S v.2","Передние и задние элементы цоколя из нержавеющей стали","комп",27143]
["ZA 60.00 HS v.2","Передние и задние элементы цоколя из нержавеющей стали","комп",24826]
["ZA 60.00 S v.2","Передние и задние элементы цоколя из нержавеющей стали","комп",19560]
["ZA 80.00 HS v.2","Передние и задние элементы цоколя из нержавеющей стали","комп",26474]
["ZA 80.00 S v.2","Передние и задние элементы цоколя из нержавеющей стали","комп",20919]
["ZA 60.00 P v.2","Передние и задние элементы цоколя с вентиляцией","комп",6386]
["ZA 80.00 P v.2","Передние и задние элементы цоколя с вентиляцией","комп",6438]
["HG 180.90 SE","Петля нержавеющая","шт",5163]
["HG 180.90 ME","Петля стальная в сборе","шт",829]
["HG 180.90 CE","Петля стальная с покрытием сатин в сборе","шт",730]
["HG 180.45 ZP","Петля цинковая в сборе, 4шт.","комп",7116]
["GB 100 R","Планка защитная","шт",1299]
["GB 40 R","Планка защитная","шт",773]
["GB 50 R","Планка защитная","шт",793]
["GB 60 R","Планка защитная","шт",1164]
["GB 80 R","Планка защитная","шт",1267]
["GB 50 RS","Планка защитная из нержавеющей стали","шт",4151]
["GB 60 RS","Планка защитная из нержавеющей стали","шт",4151]
["GB 60","Планка разделительная","шт",896]
["GB 60 RAL7004","Планка разделительная","шт",1001]
["GB 80","Планка разделительная","шт",1133]
["IK 80.60 MF","Пластины переходные рамы и цоколя, комп.","комп",{"$error":"#N/A"}]
["SH 50 D","Подставка","шт",3483]
["SH 60 D","Подставка","шт",6788]
["SH 80 D","Подставка","шт",7658]
["SH 48.35 IM","Полка 19\" выдвижная с креплением в двух плоскостях","шт",6081]
["SH 48.45 IM","Полка 19\" выдвижная с креплением в двух плоскостях","шт",6428]
["SH 48.55 IM","Полка 19\" выдвижная с креплением в двух плоскостях","шт",7271]
["SH 48.65 IM","Полка 19\" выдвижная с креплением в двух плоскостях","шт",7952]
["SH 48.35 IM2","Полка 19\" выдвижная с креплением в одной плоскости","шт",5310]
["SH 48.45 IM2","Полка 19\" выдвижная с креплением в одной плоскости","шт",5915]
["SH 45.35 I","Полка 19\" с креплением в двух плоскостях","шт",2677]
["SH 45.45 I","Полка 19\" с креплением в двух плоскостях","шт",2575]
["SH 45.55 I","Полка 19\" с креплением в двух плоскостях","шт",3275]
["SH 45.65 I","Полка 19\" с креплением в двух плоскостях","шт",3337]
["SH 45.85 I","Полка 19\" с креплением в двух плоскостях","шт",4571]
["SH 48.25 I2","Полка 19\" с креплением в одной плоскости","шт",2225]
["SH 48.35 I2","Полка 19\" с креплением в одной плоскости","шт",2493]
["SH 48.45 I2","Полка 19\" с креплением в одной плоскости","шт",2946]
["SH 48.45 I2 RAL9005","Полка 19\" с креплением в одной плоскости","шт",3289]
["SH 48.55 I2","Полка 19\" с креплением в одной плоскости с доработкой","шт",{"$error":"#N/A"}]
["SH 60.60 M","Полка выдвижная","шт",7224]
["SH 80.60 M","Полка выдвижная","шт",8053]
["SH 60.60","Полка для шкафов MPx","шт",5366]
["SH 60.60 RAL9005","Полка для шкафов MPx","шт",5992]
["SH 80.60","Полка для шкафов MPx","шт",5377]
["SH 80.60 RAL9005","Полка для шкафов MPx","шт",6003]
["SH 80.80","Полка для шкафов MPx","шт",6953]
["CL 10 EMC","Прижим кабельный с контактом ЭМС, 10шт.","комп",2802]
["CL 15 EMC","Прижим кабельный с контактом ЭМС, 10шт.","комп",1875]
["CL 20 EMC","Прижим кабельный с контактом ЭМС, 10шт.","комп",2812]
["CL 28 EMC","Прижим кабельный с контактом ЭМС, 10шт.","комп",3492]
["IK 08 MG","Присоединительный комплект, 20 комплектов","комп",4991]
["W 6.04.6.200","Провод заземления, 10шт.","комп",3067]
["W 6.04.6.400","Провод заземления, 10шт.","комп",2944]
["W 6.04.8.200","Провод заземления, 10шт.","комп",3946]
["W 6.04.8.300","Провод заземления, 10шт.","комп",5569]
["W 8.10.8.300","Провод заземления, 10шт.","комп",7377]
["T 2,5-4 SP DL","Проставка для клемм, 50 шт.","комп",{"$error":"#N/A"}]
["T2,5-4SPDL","Проставка для клемм, серый","комп",{"$error":"#N/A"}]
["SK 8.25","Проставка для шкафа компактного, 4шт.","комп",1268]
["SK 8.50","Проставка для шкафа компактного, 4шт.","комп",1137]
["SK 12.25","Проставка панели потолочной, 4шт.","комп",2616]
["SK 12.50","Проставка панели потолочной, 4шт.","комп",2970]
["SK 6.70","Проставка, 10шт.","комп",2270]
["SCD 91.120.49","Пульт управления из нержавеющей стали","шт",230548]
["SCS 91.60.49","Пульт управления из нержавеющей стали","шт",153614]
["SCS 91.80.49","Пульт управления из нержавеющей стали","шт",175656]
["MC 200.80 ID","Рама 19\" двухсторонняя для шкафов MPx","шт",16565]
["MC 200.80 IR","Рама 19\" поворотная для шкафов IPx","шт",15422]
["MC 220.80 IR","Рама 19\" поворотная для шкафов IPx","шт",18334]
["MC 200.80 IRP","Рама 19\" поворотная для шкафов MPx","шт",8961]
["MC 80.80 IRP","Рама 19\" поворотная частичная для шкафов MPx","шт",7581]
["MF 120.60.100 IT","Рама MF","шт",48110]
["MF 120.60.50","Рама MF","шт",34943]
["MF 120.60.60","Рама MF","шт",29139]
["MF 120.60.60 IT","Рама MF","шт",38439]
["MF 120.60.60 RAL7004","Рама MF","шт",33954]
["MF 120.60.80","Рама MF","шт",38347]
["MF 120.80.50","Рама MF","шт",39193]
["MF 120.80.60","Рама MF","шт",32263]
["MF 120.80.80","Рама MF","шт",55460]
["MF 140.60.40","Рама MF","шт",38089]
["MF 140.60.40 RAL7004","Рама MF","шт",33530]
["MF 140.60.60","Рама MF","шт",42881]
["MF 160.40.40","Рама MF","шт",28668]
["MF 160.60.40","Рама MF","шт",39178]
["MF 160.60.50","Рама MF","шт",42264]
["MF 160.60.60","Рама MF","шт",32868]
["MF 160.60.60 IT","Рама MF","шт",42262]
["MF 160.60.80","Рама MF","шт",39552]
["MF 160.80.40","Рама MF","шт",42849]
["MF 180.100.40","Рама MF","шт",32659]
["MF 180.100.40 RAL7004","Рама MF","шт",33275]
["MF 180.100.50","Рама MF","шт",39745]
["MF 180.100.60","Рама MF","шт",42179]
["MF 180.100.60 RAL7004","Рама MF","шт",36389]
["MF 180.100.80","Рама MF","шт",63770]
["MF 180.120.40","Рама MF","шт",34361]
["MF 180.120.50","Рама MF","шт",36864]
["MF 180.120.60","Рама MF","шт",38042]
["MF 180.40.40","Рама MF","шт",27665]
["MF 180.40.50","Рама MF","шт",26521]
["MF 180.40.50 RAL7004","Рама MF","шт",27014]
["MF 180.40.60","Рама MF","шт",25656]
["MF 180.60.100","Рама MF","шт",36718]
["MF 180.60.40","Рама MF","шт",25771]
["MF 180.60.40 RAL3020","Рама MF","шт",31506]
["MF 180.60.40 RAL7004","Рама MF","шт",32280]
["MF 180.60.50","Рама MF","шт",29183]
["MF 180.60.60","Рама MF","шт",28387]
["MF 180.60.60 RAL7004","Рама MF","шт",30229]
["MF 180.60.80","Рама MF","шт",31785]
["MF 180.60.80 IT","Рама MF","шт",49109]
["MF 180.80.100","Рама MF","шт",42286]
["MF 180.80.40","Рама MF","шт",27748]
["MF 180.80.40 RAL7004","Рама MF","шт",33522]
["MF 180.80.40 RAL9005","Рама MF","шт",34084]
["MF 180.80.50","Рама MF","шт",30014]
["MF 180.80.60","Рама MF","шт",31013]
["MF 180.80.60 RAL7004","Рама MF","шт",32917]
["MF 180.80.80","Рама MF","шт",35082]
["MF 200.100.40","Рама MF","шт",35156]
["MF 200.100.40 RAL7004","Рама MF","шт",37430]
["MF 200.100.50","Рама MF","шт",36168]
["MF 200.100.60","Рама MF","шт",36215]
["MF 200.100.60 RAL7004","Рама MF","шт",42829]
["MF 200.100.80","Рама MF","шт",39634]
["MF 200.100.80 RAL7004","Рама MF","шт",48958]
["MF 200.120.40","Рама MF","шт",37352]
["MF 200.120.40 RAL3020","Рама MF","шт",40421]
["MF 200.120.40 RAL9005","Рама MF","шт",42955]
["MF 200.120.50","Рама MF","шт",40854]
["MF 200.120.60","Рама MF","шт",38710]
["MF 200.120.60 RAL7004","Рама MF","шт",45584]
["MF 200.120.80","Рама MF","шт",44121]
["MF 200.40.40","Рама MF","шт",39979]
["MF 200.40.50","Рама MF","шт",27247]
["MF 200.40.60","Рама MF","шт",26821]
["MF 200.40.60 RAL7004","Рама MF","шт",34068]
["MF 200.40.80","Рама MF","шт",31472]
["MF 200.60.100","Рама MF","шт",42762]
["MF 200.60.100 IT","Рама MF","шт",61342]
["MF 200.60.120","Рама MF","шт",47186]
["MF 200.60.40","Рама MF","шт",27264]
["MF 200.60.40 RAL7004","Рама MF","шт",30453]
["MF 200.60.50","Рама MF","шт",30475]
["MF 200.60.60","Рама MF","шт",29190]
["MF 200.60.60 IT","Рама MF","шт",44781]
["MF 200.60.60 RAL3020","Рама MF","шт",36502]
["MF 200.60.60 RAL7004","Рама MF","шт",35426]
["MF 200.60.80","Рама MF","шт",32538]
["MF 200.60.80 IT","Рама MF","шт",50389]
["MF 200.60.80 IT RAL9005","Рама MF","шт",55097]
["MF 200.80.100","Рама MF","шт",40479]
["MF 200.80.100 IT","Рама MF","шт",62370]
["MF 200.80.120","Рама MF","шт",54880]
["MF 200.80.120 IT","Рама MF","шт",72464]
["MF 200.80.120 IT RAL9005","Рама MF","шт",76409]
["MF 200.80.40","Рама MF","шт",28263]
["MF 200.80.40 RAL3020","Рама MF","шт",32390]
["MF 200.80.40 RAL7004","Рама MF","шт",30386]
["MF 200.80.40 RAL9005","Рама MF","шт",35343]
["MF 200.80.50","Рама MF","шт",31497]
["MF 200.80.60","Рама MF","шт",32373]
["MF 200.80.60 IT","Рама MF","шт",52674]
["MF 200.80.60 RAL3020","Рама MF","шт",40482]
["MF 200.80.60 RAL7004","Рама MF","шт",38237]
["MF 200.80.80","Рама MF","шт",48029]
["MF 200.80.80 IT","Рама MF","шт",59977]
["MF 220.100.60","Рама MF","шт",37279]
["MF 220.100.80","Рама MF","шт",66765]
["MF 220.100.80 RAL7004","Рама MF","шт",75532]
["MF 220.120.60","Рама MF","шт",39573]
["MF 220.120.60 RAL7004","Рама MF","шт",40566]
["MF 220.120.60 RAL9005","Рама MF","шт",47553]
["MF 220.120.80","Рама MF","шт",51061]
["MF 220.40.40","Рама MF","шт",41996]
["MF 220.40.60","Рама MF","шт",34463]
["MF 220.40.80","Рама MF","шт",52406]
["MF 220.60.100","Рама MF","шт",38412]
["MF 220.60.100 IT","Рама MF","шт",54320]
["MF 220.60.120 IT","Рама MF","шт",55574]
["MF 220.60.40","Рама MF","шт",43716]
["MF 220.60.60","Рама MF","шт",29613]
["MF 220.60.60 RAL7004","Рама MF","шт",35504]
["MF 220.60.80","Рама MF","шт",33465]
["MF 220.60.80 IT","Рама MF","шт",51500]
["MF 220.60.80 RAL7004","Рама MF","шт",41848]
["MF 220.80.100","Рама MF","шт",42896]
["MF 220.80.100 IT","Рама MF","шт",62767]
["MF 220.80.120 IT","Рама MF","шт",62048]
["MF 220.80.40","Рама MF","шт",47387]
["MF 220.80.60","Рама MF","шт",32548]
["MF 220.80.60 RAL7004","Рама MF","шт",34630]
["MF 220.80.60 RAL9005","Рама MF","шт",40675]
["MF 220.80.80","Рама MF","шт",36302]
["MF 220.80.80 RAL7004","Рама MF","шт",39413]
["MF 180.80.50 S","Рама MF из нержавеющей стали","шт",109861]
["MF 200.60.60 S","Рама MF из нержавеющей стали","шт",130329]
["MF 200.80.60 S","Рама MF из нержавеющей стали","шт",140247]
["MF 120.60.60 D","Рама MF с дополнительным вводом сверху","шт",33852]
["MF 120.60.60 D RAL9005","Рама MF с дополнительным вводом сверху","шт",36743]
["MF 120.80.80 D","Рама MF с дополнительным вводом сверху","шт",41474]
["MF 180.120.40 D","Рама MF с дополнительным вводом сверху","шт",37722]
["MF 180.60.100 D","Рама MF с дополнительным вводом сверху","шт",37800]
["MF 180.60.40 D","Рама MF с дополнительным вводом сверху","шт",27586]
["MF 180.60.60 D","Рама MF с дополнительным вводом сверху","шт",30363]
["MF 180.60.80 D","Рама MF с дополнительным вводом сверху","шт",34014]
["MF 180.80.100 D","Рама MF с дополнительным вводом сверху","шт",42280]
["MF 180.80.40 D","Рама MF с дополнительным вводом сверху","шт",30867]
["MF 180.80.60 D","Рама MF с дополнительным вводом сверху","шт",33891]
["MF 180.80.80 D","Рама MF с дополнительным вводом сверху","шт",38259]
["MF 200.120.60 D","Рама MF с дополнительным вводом сверху","шт",46458]
["MF 200.60.100 D","Рама MF с дополнительным вводом сверху","шт",38539]
["MF 200.60.40 D","Рама MF с дополнительным вводом сверху","шт",28325]
["MF 200.60.60 D","Рама MF с дополнительным вводом сверху","шт",31936]
["MF 200.60.80 D","Рама MF с дополнительным вводом сверху","шт",34754]
["MF 200.80.100 D","Рама MF с дополнительным вводом сверху","шт",44172]
["MF 200.80.120 D","Рама MF с дополнительным вводом сверху","шт",57982]
["MF 200.80.40 D","Рама MF с дополнительным вводом сверху","шт",32453]
["MF 200.80.60 D","Рама MF с дополнительным вводом сверху","шт",34530]
["MF 200.80.80 D","Рама MF с дополнительным вводом сверху","шт",46342]
["MF 220.60.100 D","Рама MF с дополнительным вводом сверху","шт",43086]
["MF 220.60.60 D","Рама MF с дополнительным вводом сверху","шт",31786]
["MF 220.60.80 D","Рама MF с дополнительным вводом сверху","шт",35437]
["MF 220.80.100 D","Рама MF с дополнительным вводом сверху","шт",43702]
["MF 220.80.60 D","Рама MF с дополнительным вводом сверху","шт",38472]
["MF 220.80.80 D","Рама MF с дополнительным вводом сверху","шт",43254]
["MF 180.60.100 A","Рама MF усиленная","шт",47894]
["MF 180.60.40 A","Рама MF усиленная","шт",32043]
["MF 180.60.60 A","Рама MF усиленная","шт",34771]
["MF 200.100.60 A","Рама MF усиленная","шт",41602]
["MF 200.100.80 A","Рама MF усиленная","шт",46255]
["MF 200.120.60 A","Рама MF усиленная","шт",42698]
["MF 200.120.80 A","Рама MF усиленная","шт",46321]
["MF 200.60.40 A","Рама MF усиленная","шт",32758]
["MF 200.60.60 A","Рама MF усиленная","шт",35497]
["MF 200.80.100 A","Рама MF усиленная","шт",70582]
["MF 200.80.40 A","Рама MF усиленная","шт",34628]
["MF 200.80.60 A","Рама MF усиленная","шт",36038]
["MF 200.80.80 A","Рама MF усиленная","шт",42350]
["MF 220.40.80 A","Рама MF усиленная","шт",42262]
["MF 220.60.100 A","Рама MF усиленная","шт",50732]
["MF 220.60.80 A","Рама MF усиленная","шт",49291]
["IFO 24.57.00","Рама дополнительная к стойке телекоммуникационной IFO","шт",9454]
["IFO 36.57.00","Рама дополнительная к стойке телекоммуникационной IFO","шт",9280]
["IFO 42.57.00","Рама дополнительная к стойке телекоммуникационной IFO","шт",9199]
["IFO 45.57.00","Рама дополнительная к стойке телекоммуникационной IFO","шт",10741]
["MC 180.60","Рама модульная","шт",10326]
["MC 180.80","Рама модульная","шт",8720]
["MC 200.120","Рама модульная","шт",5652]
["MC 200.40","Рама модульная","шт",4603]
["MC 200.60","Рама модульная","шт",10405]
["MC 200.80","Рама модульная","шт",10584]
["MC 220.100","Рама модульная","шт",5663]
["MC 220.60","Рама модульная","шт",5130]
["MC 220.80","Рама модульная","шт",4469]
["MC 180.60 R","Рама модульная поворотная","шт",13821]
["MC 180.80 R","Рама модульная поворотная","шт",13706]
["MC 200.60 R","Рама модульная поворотная","шт",14421]
["MC 200.80 R","Рама модульная поворотная","шт",15736]
["MC 220.60 R","Рама модульная поворотная","шт",18073]
["IF 120.60.100","Рама телекоммуникационная IF","шт",31360]
["IF 120.60.60","Рама телекоммуникационная IF","шт",25066]
["IF 120.60.80","Рама телекоммуникационная IF","шт",28056]
["IF 120.80.100","Рама телекоммуникационная IF","шт",34093]
["IF 120.80.60","Рама телекоммуникационная IF","шт",27216]
["IF 120.80.80","Рама телекоммуникационная IF","шт",31372]
["IF 180.60.100","Рама телекоммуникационная IF","шт",34512]
["IF 180.60.60","Рама телекоммуникационная IF","шт",29501]
["IF 180.60.80","Рама телекоммуникационная IF","шт",34754]
["IF 180.80.100","Рама телекоммуникационная IF","шт",36243]
["IF 180.80.60","Рама телекоммуникационная IF","шт",29246]
["IF 180.80.80","Рама телекоммуникационная IF","шт",32682]
["IF 200.60.100","Рама телекоммуникационная IF","шт",35041]
["IF 200.60.60","Рама телекоммуникационная IF","шт",30139]
["IF 200.60.80","Рама телекоммуникационная IF","шт",30372]
["IF 200.80.100","Рама телекоммуникационная IF","шт",39698]
["IF 200.80.60","Рама телекоммуникационная IF","шт",29343]
["IF 200.80.80","Рама телекоммуникационная IF","шт",33327]
["IF 220.60.100","Рама телекоммуникационная IF","шт",34922]
["IF 220.60.60","Рама телекоммуникационная IF","шт",27154]
["IF 220.60.80","Рама телекоммуникационная IF","шт",30464]
["IF 220.80.100","Рама телекоммуникационная IF","шт",39547]
["IF 220.80.60","Рама телекоммуникационная IF","шт",30283]
["IF 220.80.80","Рама телекоммуникационная IF","шт",33230]
["MF 220.40.80 DA","Рама усиленная с дополнительным вводом сверху","шт",45010]
["LMFD 200.60.60-1600A-OU-1-1","Распределительная панель","шт",286250]
["LMFD 200.60.60-1600A-OU-1-2","Распределительная панель","шт",286250]
["LMFD 200.60.80-1600A-OU-1-1","Распределительная панель","шт",620150]
["LMFD 200.60.80-2000A-OU-1-1","Распределительная панель","шт",372100]
["LMFD 200.60.80-2500A-OU-1-1","Распределительная панель","шт",454800]
["LMFD 200.60.80-3200A-OU-1-1","Распределительная панель","шт",537450]
["LMFD 200.60.80-4000A-OU-1-1","Распределительная панель","шт",661500]
["LMFD 200.80.80-1600A-OU-1-2","Распределительная панель","шт",631050]
["LMFD 200.80.80-2000A-OU-1-2","Распределительная панель","шт",879100]
["LMFD 200.80.80-2500A-OU-1-2","Распределительная панель","шт",1044500]
["LMFD 200.80.80-3200A-OU-1-2","Распределительная панель","шт",1127150]
["LMFD 200.80.80-4000A-OU-1-2","Распределительная панель","шт",1424850]
["IG 09 IES","Рейка вертикальная 19\" для IEx, 2шт.","комп",638]
["IG 12 IES","Рейка вертикальная 19\" для IEx, 2шт.","комп",679]
["IG 16 IES","Рейка вертикальная 19\" для IEx, 2шт.","комп",795]
["IG 21 IES","Рейка вертикальная 19\" для IEx, 2шт.","комп",1053]
["IG 09","Рейка вертикальная 19\" для шкафов IPx, 2шт.","комп",1359]
["IG 09 L","Рейка вертикальная 19\" для шкафов IPx, 2шт.","комп",1266]
["IG 12","Рейка вертикальная 19\" для шкафов IPx, 2шт.","комп",1781]
["IG 12 L","Рейка вертикальная 19\" для шкафов IPx, 2шт.","комп",1340]
["IG 16","Рейка вертикальная 19\" для шкафов IPx, 2шт.","комп",1936]
["IG 16 L","Рейка вертикальная 19\" для шкафов IPx, 2шт.","комп",1490]
["IG 21","Рейка вертикальная 19\" для шкафов IPx, 2шт.","комп",2475]
["IG 21 L","Рейка вертикальная 19\" для шкафов IPx, 2шт.","комп",1900]
["IG 24","Рейка вертикальная 19\" для шкафов IPx, 2шт.","комп",3038]
["IG 24 L","Рейка вертикальная 19\" для шкафов IPx, 2шт.","комп",2130]
["IG 38","Рейка вертикальная 19\" для шкафов IPx, 2шт.","комп",3701]
["IG 38 L","Рейка вертикальная 19\" для шкафов IPx, 2шт.","комп",2740]
["IG 43","Рейка вертикальная 19\" для шкафов IPx, 2шт.","комп",3471]
["IG 43 L","Рейка вертикальная 19\" для шкафов IPx, 2шт.","комп",3735]
["IG 47","Рейка вертикальная 19\" для шкафов IPx, 2шт.","комп",4215]
["IG 47 L","Рейка вертикальная 19\" для шкафов IPx, 2шт.","комп",3260]
["MG 120 IT","Рейка вертикальная 19\", 4шт.","комп",6261]
["MG 140 IT","Рейка вертикальная 19\", 4шт.","комп",2691]
["MG 160 IT","Рейка вертикальная 19\", 4шт.","комп",3358]
["MG 180 IT","Рейка вертикальная 19\", 4шт.","комп",7402]
["MG 200 IT","Рейка вертикальная 19\", 4шт.","комп",8121]
["MG 220 IT","Рейка вертикальная 19\", 4шт.","комп",8727]
["MG 180 MC","Рейка вертикальная модульная, 2шт.","комп",3410]
["MG 200 MC","Рейка вертикальная модульная, 2шт.","комп",3728]
["MG 48.03 I","Рейка горизонтальная 19\", 2шт.","комп",918]
["VB 40 GE","Рейка для глухой двери горизонтальная, 10шт.","комп",2208]
["VB 50 GE","Рейка для глухой двери горизонтальная, 10шт.","комп",2598]
["VB 60 GE","Рейка для глухой двери горизонтальная, 10шт.","комп",2576]
["VB 80 GE","Рейка для глухой двери горизонтальная, 10шт.","комп",3125]
["VB 40 G","Рейка для глухой двери, 10шт.","комп",4738]
["VB 50 G","Рейка для глухой двери, 10шт.","комп",5202]
["VB 60 G","Рейка для глухой двери, 10шт.","комп",5871]
["VB 80 G","Рейка для глухой двери, 10шт.","комп",6726]
["VB 100","Рейка для глухой двери, 2шт.","комп",783]
["VB 120","Рейка для глухой двери, 2шт.","комп",937]
["VB 140","Рейка для глухой двери, 2шт.","комп",1030]
["VB 160","Рейка для глухой двери, 2шт.","комп",880]
["VB 50","Рейка для глухой двери, 2шт.","комп",464]
["VB 60","Рейка для глухой двери, 2шт.","комп",515]
["VB 70","Рейка для глухой двери, 2шт.","комп",597]
["VB 80","Рейка для глухой двери, 2шт.","комп",659]
["MG 100","Рейка кабельная","шт",752]
["MG 40","Рейка кабельная","шт",484]
["MG 60","Рейка кабельная","шт",649]
["MG 80","Рейка кабельная","шт",773]
["MG 60 EMC","Рейка кабельная с контактом ЭМС","шт",1680]
["MG 80 EMC","Рейка кабельная с контактом ЭМС","шт",1936]
["MG 100.10 I","Рейка монтажная рамы IF, 2шт.","комп",3259]
["MG 60.10 I","Рейка монтажная рамы IF, 2шт.","комп",2262]
["MG 80.10 I","Рейка монтажная рамы IF, 2шт.","комп",12930]
["MG 30 E","Рейка монтажная распорная, 4 шт.","комп",3102]
["MG 50 E","Рейка монтажная распорная, 4 шт.","комп",3842]
["MG 60.02 B","Рейка монтажная секционная, 4шт.","комп",1227]
["MG 80.02 B","Рейка монтажная секционная, 4шт.","комп",1768]
["MG 100.06","Рейка монтажная, 4шт.","комп",4211]
["MG 100.06 L v.2","Рейка монтажная, 4шт.","комп",5974]
["MG 100.09","Рейка монтажная, 4шт.","комп",4481]
["MG 100.09 L v.2","Рейка монтажная, 4шт.","комп",6489]
["MG 120.06","Рейка монтажная, 4шт.","комп",3902]
["MG 120.06 L v.2","Рейка монтажная, 4шт.","комп",5377]
["MG 120.09","Рейка монтажная, 4шт.","комп",5181]
["MG 120.09 L v.2","Рейка монтажная, 4шт.","комп",7138]
["MG 180.09 L v.2","Рейка монтажная, 4шт.","комп",8034]
["MG 200.09 L v.2","Рейка монтажная, 4шт.","комп",9641]
["MG 220.09 L v.2","Рейка монтажная, 4шт.","комп",9043]
["MG 40.02","Рейка монтажная, 4шт.","комп",706]
["MG 40.06","Рейка монтажная, 4шт.","комп",2240]
["MG 40.06 L v.2","Рейка монтажная, 4шт.","комп",4413]
["MG 40.09","Рейка монтажная, 4шт.","комп",2359]
["MG 40.09 L v.2","Рейка монтажная, 4шт.","комп",4547]
["MG 50.06","Рейка монтажная, 4шт.","комп",2610]
["MG 50.06 L v.2","Рейка монтажная, 4шт.","комп",5085]
["MG 50.09","Рейка монтажная, 4шт.","комп",2709]
["MG 50.09 L v.2","Рейка монтажная, 4шт.","комп",4547]
["MG 60.02","Рейка монтажная, 4шт.","комп",739]
["MG 60.06","Рейка монтажная, 4шт.","комп",2934]
["MG 60.06 L v.2","Рейка монтажная, 4шт.","комп",4954]
["MG 60.09","Рейка монтажная, 4шт.","комп",3069]
["MG 60.09 L v.2","Рейка монтажная, 4шт.","комп",5174]
["MG 80.02","Рейка монтажная, 4шт.","комп",2789]
["MG 80.06","Рейка монтажная, 4шт.","комп",3573]
["MG 80.06 L v.2","Рейка монтажная, 4шт.","комп",5469]
["MG 80.09","Рейка монтажная, 4шт.","комп",3770]
["MG 80.09 L v.2","Рейка монтажная, 4шт.","комп",5428]
["MG 100.09 IL","Рейка монтажная, 6шт.","комп",9946]
["MG 120.09 IL","Рейка монтажная, 6шт.","комп",8448]
["MG 60.09 IL","Рейка монтажная, 6шт.","комп",5197]
["MG 80.09 IL","Рейка монтажная, 6шт.","комп",6323]
["MG 40.03","Рейка монтажная, 8шт.","комп",3234]
["MG 50.03","Рейка монтажная, 8шт.","комп",3245]
["MG 60.03","Рейка монтажная, 8шт.","комп",4120]
["MG 80.03","Рейка монтажная, 8шт.","комп",4923]
["MF 40 MP","Рейка направляющая для рамы MF, 2шт.","комп",1050]
["MF 60 MP","Рейка направляющая для рамы MF, 2шт.","комп",1501]
["MG 40.07 R","Рейка опорная для основания, 2шт.","комп",773]
["MG 50.07 R","Рейка опорная для основания, 2шт.","комп",896]
["MG 60.07 R","Рейка опорная для основания, 2шт.","комп",1019]
["MG 80.07 R","Рейка опорная для основания, 2шт.","комп",1266]
["MG 35.03 IL","Рейка опорная, 2шт.","комп",1092]
["MG 45.03 IL","Рейка опорная, 2шт.","комп",1318]
["MG 55.03 IL","Рейка опорная, 2шт.","комп",1298]
["MG 65.03 IL","Рейка опорная, 2шт.","комп",1473]
["FF 08 D","Решетка с фильтром","шт",1165]
["FF 12 D","Решетка с фильтром","шт",1394]
["FF 13 D","Решетка с фильтром","шт",1494]
["FF 15 D","Решетка с фильтром","шт",1761]
["FF 20 D","Решетка с фильтром","шт",2189]
["C 30 E","Ролик направляющий MEx","комп",571]
["C 30 P","Ролик направляющий MPx","комп",538]
["C 10.110","Ролик транспортировочный М10, 2шт.","комп",2335]
["C 12.125","Ролик транспортировочный М12, 2шт.","комп",3134]
["C 10.110 T","Ролик транспортировочный с тормозом М10, 2шт.","комп",3450]
["C 12.125 T","Ролик транспортировочный с тормозом М12, 2шт.","комп",3945]
["HD 250.45 Z","Ручка 250 мм","шт",9206]
["HD 122.40 P","Ручка пластиковая","шт",1624]
["LH 2C.P","Ручка поворотная без цилиндра","шт",5835]
["LH 1C.Z","Ручка поворотная с цилиндром","шт",4192]
["LE 12","Рым-болт, 4шт.","комп",1195]
["ZB 22.14","Сальниковая панель ZB","шт",330]
["ZB 23.19","Сальниковая панель ZB","шт",830]
["ZB 29.24","Сальниковая панель ZB","шт",520]
["LA 5 LED","Светильник светодиодный","шт",4800]
["LA 5 LED M","Светильник светодиодный","шт",3657]
["LA 5.024 LED M","Светильник светодиодный 24В","шт",3986]
["LA 5 LED S","Светильник светодиодный с датчиком движения","шт",5572]
["LMFS 200.100.80-2000A-OU-1","Секционная панель","шт",2463800]
["LMFS 200.100.80-2500A-OU-1","Секционная панель","шт",2910300]
["LMFS 200.100.80-3200A-OU-1","Секционная панель","шт",2819350]
["LMFS 200.100.80-4000A-OU-1","Секционная панель","шт",3604850]
["LMFS 200.80.60-1600A-OU-1","Секционная панель","шт",1088750]
["LMFS 200.80.80-1600A-OU-1","Секционная панель","шт",1093900]
["MN 180.100","Сетка монтажная","шт",48182]
["MN 180.60","Сетка монтажная","шт",26029]
["MN 180.80","Сетка монтажная","шт",38987]
["MN 200.100","Сетка монтажная","шт",43139]
["MN 200.60","Сетка монтажная","шт",17188]
["MN 200.80","Сетка монтажная","шт",41331]
["MN 120.60 M","Сетка монтажная секционная","шт",19387]
["MN 120.80 M","Сетка монтажная секционная","шт",27451]
["MN 160.100 M","Сетка монтажная секционная","шт",30450]
["MN 160.60 M","Сетка монтажная секционная","шт",21013]
["MN 160.80 M","Сетка монтажная секционная","шт",31122]
["MN 180.100 M","Сетка монтажная секционная","шт",39307]
["MN 180.120 M","Сетка монтажная секционная","шт",60780]
["MN 180.40 M","Сетка монтажная секционная","шт",20590]
["MN 180.60 M","Сетка монтажная секционная","шт",24394]
["MN 180.80 M","Сетка монтажная секционная","шт",37453]
["MN 90.100 M","Сетка монтажная секционная","шт",22465]
["MN 90.80 M","Сетка монтажная секционная","шт",21412]
["LC 140.5 DB.E","Система запорная штанговая 1400мм","комп",2590]
["LC 160.5 DB.P","Система запорная штанговая 1600мм","комп",3740]
["LC 180.5 DB.P","Система запорная штанговая 1800мм","комп",3740]
["LC 200.5 DB.P","Система запорная штанговая 2000мм","комп",5051]
["LC 220.5 DB.P","Система запорная штанговая 2200мм","комп",4750]
["WB 12","Скобы для монтажа к стене шкафов MPx, 2шт.","комп",672]
["WB 6 S","Скобы для монтажа на стене из нержавеющей стали, 4шт.","комп",1240]
["WB 8 BS","Скобы для монтажа на стене из нержавеющей стали, 4шт.","комп",2708]
["WB 8 S","Скобы для монтажа на стене из нержавеющей стали, 4шт.","комп",1957]
["WB 6","Скобы для монтажа на стене, 4шт.","комп",575]
["WB 8","Скобы для монтажа на стене, 4шт.","комп",536]
["WB 8 B","Скобы для монтажа на стене, 4шт.","комп",824]
["IK 01","Соединительный комплект","комп",2117]
["IK 02 I","Соединительный комплект IFO","комп",1575]
["IK 01 I","Соединительный комплект IT","комп",1391]
["IK 01 O","Соединительный комплект внешний, 8 шт.","комп",4043]
["IK 08 HD","Соединительный комплект КРУ","шт",{"$error":"#N/A"}]
["IK 10 HM","Соединительный комплект КРУ","шт",{"$error":"#N/A"}]
["IK 03 MP","Соединительный комплект монтажных панелей","комп",156]
["IK 03","Соединительный комплект систем управления","комп",414]
["IK 01 ZA v.2","Соединительный комплект цоколей","комп",202]
["MCS 20.120.81 D","Средняя часть пульта","шт",42807]
["MCS 20.160.81 D","Средняя часть пульта","шт",45341]
["MCS 20.160.90 DK","Средняя часть пульта","шт",138115]
["MCS 20.80.81 D","Средняя часть пульта","шт",34340]
["MCS 20.80.90 DK","Средняя часть пульта","шт",103494]
["MCS 27.120.49 D","Средняя часть пульта","шт",39099]
["MCS 27.60.49 D","Средняя часть пульта","шт",26841]
["MCS 27.80.49 D","Средняя часть пульта","шт",29807]
["ZL 30.21","Стойка монтажная","шт",14743]
["ZL 40.21","Стойка монтажная","шт",15347]
["IFO 24.57.74","Стойка телекоммуникационная IFO","шт",11312]
["IFO 36.57.74","Стойка телекоммуникационная IFO","шт",12399]
["IFO 42.57.74","Стойка телекоммуникационная IFO","шт",12442]
["IFO 45.57.74","Стойка телекоммуникационная IFO","шт",14078]
["TS 6.230 NCD","Терморегулятор","шт",1557]
["TS 6.230 NOD","Терморегулятор","шт",1546]
["TS 6.230 NONC","Терморегулятор NO+NC","шт",3275]
["MG 100.04 CL","Траверса монтажная, 4шт.","комп",2981]
["MG 40.04 CL","Траверса монтажная, 4шт.","комп",1864]
["MG 50.04 CL","Траверса монтажная, 4шт.","комп",2173]
["MG 60.04 CL","Траверса монтажная, 4шт.","комп",2524]
["MG 80.04 CL","Траверса монтажная, 4шт.","комп",3286]
["MG 100.04 C","Траверса монтажная, 6шт.","комп",5212]
["MG 120.04 C","Траверса монтажная, 6шт.","комп",5799]
["MG 40.04 C","Траверса монтажная, 6шт.","комп",2778]
["MG 50.04 C","Траверса монтажная, 6шт.","комп",3512]
["MG 60.04 C","Траверса монтажная, 6шт.","комп",4120]
["MG 80.04 C","Траверса монтажная, 6шт.","комп",4594]
["Z 100 D","Угловой элемент цоколя двойной, 2шт.","комп",4614]
["Z 200 D","Угловой элемент цоколя двойной, 2шт.","комп",5600]
["Z 100 I","Угловой элемент цоколя телекоммуникационного, 4шт.","комп",4106]
["Z 200 I","Угловой элемент цоколя телекоммуникационного, 4шт.","комп",4558]
["Z 100","Угловой элемент цоколя, 4шт.","комп",5331]
["Z 200","Угловой элемент цоколя, 4шт.","комп",6714]
["MG 200.04","Уголок монтажный усиления рамы, 4шт.","комп",5007]
["G 20.40 G","Уплотнитель самоклеющий расширяющийся, 7,5м.","шт",4648]
["G 10.5 G","Уплотнитель самоклеющий, 10м.","шт",496]
["MG 100.05 MP","Усилитель монтажной панели, 4шт.","комп",4122]
["MG 120.05 MP","Усилитель монтажной панели, 4шт.","комп",4043]
["MG 60.05 MP","Усилитель монтажной панели, 4шт.","комп",3584]
["MG 80.05 MP","Усилитель монтажной панели, 4шт.","комп",4099]
["B 6 MP","Фиксатор монтажной панели, 10шт.","комп",2167]
["B 8 MP","Фиксатор монтажной панели, 10шт.","комп",3965]
["F 08 G3","Фильтр сменный, 6 шт.","комп",2430]
["F 12 G3","Фильтр сменный, 6 шт.","комп",2990]
["F 12 G4","Фильтр сменный, 6 шт.","комп",4155]
["F 13 G3","Фильтр сменный, 6 шт.","комп",4682]
["F 13 G4","Фильтр сменный, 6 шт.","комп",6030]
["F 15 G3","Фильтр сменный, 6 шт.","комп",6227]
["F 15 G4","Фильтр сменный, 6 шт.","комп",8859]
["F 20 G3","Фильтр сменный, 6 шт.","комп",9464]
["F 20 G4","Фильтр сменный, 6 шт.","комп",12286]
["FBM 20.60","Функциональный блок FBM","комп",1904]
["FBM 20.80","Функциональный блок FBM","комп",2257]
["EK 8 GP","Центральная точка заземления, комп.","комп",403]
["ZA 80.60 EQ","Цоколь сейсмостойкий","шт",23742]
["ZA 60.60 I","Цоколь телекоммуникационный для шкафов IPx","шт",6798]
["ZA 60.60 IH","Цоколь телекоммуникационный для шкафов IPx","шт",9654]
["ZA 60.80 I","Цоколь телекоммуникационный для шкафов IPx","шт",7650]
["ZA 60.80 IH","Цоколь телекоммуникационный для шкафов IPx","шт",10573]
["ZA 80.80 I","Цоколь телекоммуникационный для шкафов IPx","шт",7885]
["ZA 80.80 IH","Цоколь телекоммуникационный для шкафов IPx","шт",10741]
["ZA 60.100 IM","Цоколь телекоммуникационный с защитой от опрокидывания","шт",16688]
["ZH 30.30","Цоколь увеличенный","шт",4693]
["ZH 30.30 RAL7004","Цоколь увеличенный","шт",5253]
["ZH 30.30 RAL9005","Цоколь увеличенный","шт",5320]
["ZH 30.40","Цоколь увеличенный","шт",5555]
["ZH 30.40 RAL7004","Цоколь увеличенный","шт",5566]
["ZH 45.30","Цоколь увеличенный","шт",6578]
["ZH 45.30 RAL9005","Цоколь увеличенный","шт",7067]
["ZH 45.40","Цоколь увеличенный","шт",6969]
["ZH 45.30 S","Цоколь увеличенный из нержавеющей стали","шт",11600]
["MC 100.60","Шасси модульное","шт",13905]
["MC 120.60","Шасси модульное","шт",16006]
["MC 120.80","Шасси модульное","шт",18435]
["MC 50.40","Шасси модульное","шт",6850]
["MC 60.40","Шасси модульное","шт",8621]
["MC 60.60","Шасси модульное","шт",9397]
["MC 80.60","Шасси модульное","шт",10897]
["BB 10 E","Шина заземления","шт",794]
["BI 1.45 E","Шина заземления 450 мм, комп.","комп",3481]
["BB 10 N","Шина зануления","шт",702]
["BI 1.115 N","Шина зануления 1145 мм, комп.","комп",3968]
["BI 1.45 N","Шина зануления 450 мм, комп.","комп",3121]
["MES 100.80.30 Ex","Шкаф компактный взрывозащищенный","шт",36378]
["MES 120.80.30 Ex","Шкаф компактный взрывозащищенный","шт",41983]
["MES 30.20.15 Ex","Шкаф компактный взрывозащищенный","шт",8220]
["MES 30.20.15 Ex RAL9016","Шкаф компактный взрывозащищенный","шт",17660]
["MES 30.40.15 Ex","Шкаф компактный взрывозащищенный","шт",10705]
["MES 40.30.15 Ex","Шкаф компактный взрывозащищенный","шт",10797]
["MES 40.30.15 Ex RAL9016","Шкаф компактный взрывозащищенный","шт",11253]
["MES 40.40.21 Ex","Шкаф компактный взрывозащищенный","шт",13511]
["MES 40.40.21 Ex RAL9016","Шкаф компактный взрывозащищенный","шт",21470]
["MES 50.40.21 Ex","Шкаф компактный взрывозащищенный","шт",15228]
["MES 50.40.21 Ex RAL9016","Шкаф компактный взрывозащищенный","шт",15245]
["MES 50.50.21 Ex","Шкаф компактный взрывозащищенный","шт",16117]
["MES 50.50.21 Ex RAL9016","Шкаф компактный взрывозащищенный","шт",16686]
["MES 60.40.21 Ex","Шкаф компактный взрывозащищенный","шт",15803]
["MES 60.60.25 Ex","Шкаф компактный взрывозащищенный","шт",18811]
["MES 60.60.25 Ex RAL9016","Шкаф компактный взрывозащищенный","шт",26600]
["MES 70.50.25 Ex","Шкаф компактный взрывозащищенный","шт",19330]
["MES 80.60.30 Ex","Шкаф компактный взрывозащищенный","шт",24285]
["SES 100.80.30 Ex","Шкаф компактный взрывозащищенный из нержавеющей стали","шт",112177]
["SES 120.80.30 Ex","Шкаф компактный взрывозащищенный из нержавеющей стали","шт",118830]
["SES 30.20.15 Ex","Шкаф компактный взрывозащищенный из нержавеющей стали","шт",24932]
["SES 30.40.15 Ex","Шкаф компактный взрывозащищенный из нержавеющей стали","шт",29076]
["SES 40.30.15 Ex","Шкаф компактный взрывозащищенный из нержавеющей стали","шт",45660]
["SES 40.40.21 Ex","Шкаф компактный взрывозащищенный из нержавеющей стали","шт",37142]
["SES 50.40.21 Ex","Шкаф компактный взрывозащищенный из нержавеющей стали","шт",49057]
["SES 50.50.21 Ex","Шкаф компактный взрывозащищенный из нержавеющей стали","шт",52785]
["SES 60.40.21 Ex","Шкаф компактный взрывозащищенный из нержавеющей стали","шт",41653]
["SES 60.60.25 Ex","Шкаф компактный взрывозащищенный из нержавеющей стали","шт",59539]
["SES 70.50.25 Ex","Шкаф компактный взрывозащищенный из нержавеющей стали","шт",59651]
["SES 80.60.30 Ex","Шкаф компактный взрывозащищенный из нержавеющей стали","шт",73472]
["MES 60.40.21 OD","Шкаф компактный ВОЛС","шт",23251]
["MES 100.60.21","Шкаф компактный распределительный","шт",27574]
["MES 100.60.21 RAL3020","Шкаф компактный распределительный","шт",27630]
["MES 100.60.21 RAL7004","Шкаф компактный распределительный","шт",23722]
["MES 100.60.25","Шкаф компактный распределительный","шт",23762]
["MES 100.60.25 RAL3020","Шкаф компактный распределительный","шт",26611]
["MES 100.60.25 RAL7004","Шкаф компактный распределительный","шт",25693]
["MES 100.60.30","Шкаф компактный распределительный","шт",24767]
["MES 100.60.30 RAL3020","Шкаф компактный распределительный","шт",27236]
["MES 100.60.30 RAL7004","Шкаф компактный распределительный","шт",27765]
["MES 100.60.40","Шкаф компактный распределительный","шт",27982]
["MES 100.60.40 RAL7004","Шкаф компактный распределительный","шт",34328]
["MES 100.80.25","Шкаф компактный распределительный","шт",29960]
["MES 100.80.30","Шкаф компактный распределительный","шт",27209]
["MES 100.80.30 RAL3020","Шкаф компактный распределительный","шт",27609]
["MES 100.80.30 RAL7004","Шкаф компактный распределительный","шт",33824]
["MES 100.80.40","Шкаф компактный распределительный","шт",33162]
["MES 120.60.21","Шкаф компактный распределительный","шт",25917]
["MES 120.60.21 RAL3020","Шкаф компактный распределительный","шт",27877]
["MES 120.60.21 RAL7004","Шкаф компактный распределительный","шт",29501]
["MES 120.60.30","Шкаф компактный распределительный","шт",28731]
["MES 120.60.30 RAL3020","Шкаф компактный распределительный","шт",33522]
["MES 120.60.30 RAL7004","Шкаф компактный распределительный","шт",32267]
["MES 120.60.40","Шкаф компактный распределительный","шт",33739]
["MES 120.60.40 RAL3020","Шкаф компактный распределительный","шт",39464]
["MES 120.80.30","Шкаф компактный распределительный","шт",32985]
["MES 120.80.30 RAL3020","Шкаф компактный распределительный","шт",33805]
["MES 120.80.30 RAL7004       ","Шкаф компактный распределительный","шт",37419]
["MES 120.80.40","Шкаф компактный распределительный","шт",38501]
["MES 120.80.40 RAL3020","Шкаф компактный распределительный","шт",44934]
["MES 120.80.40 RAL7004","Шкаф компактный распределительный","шт",48986]
["MES 120.80.40 RAL7038","Шкаф компактный распределительный","шт",48145]
["MES 140.60.40","Шкаф компактный распределительный","шт",41446]
["MES 140.60.40 RAL3020","Шкаф компактный распределительный","шт",46420]
["MES 140.60.40 RAL7004","Шкаф компактный распределительный","шт",41306]
["MES 140.80.30","Шкаф компактный распределительный","шт",47046]
["MES 140.80.30 RAL7004","Шкаф компактный распределительный","шт",55697]
["MES 140.80.40","Шкаф компактный распределительный","шт",60599]
["MES 140.80.40 RAL3020","Шкаф компактный распределительный","шт",58218]
["MES 140.80.40 RAL7004","Шкаф компактный распределительный","шт",51363]
["MES 160.40.30","Шкаф компактный распределительный","шт",32034]
["MES 160.60.40","Шкаф компактный распределительный","шт",44733]
["MES 180.60.30 RAL7004","Шкаф компактный распределительный","шт",35569]
["MES 20.20.08","Шкаф компактный распределительный","шт",3816]
["MES 20.20.12","Шкаф компактный распределительный","шт",4894]
["MES 200.40.30","Шкаф компактный распределительный","шт",{"$error":"#N/A"}]
["MES 30.20.08","Шкаф компактный распределительный","шт",5104]
["MES 30.20.12","Шкаф компактный распределительный","шт",5466]
["MES 30.20.15","Шкаф компактный распределительный","шт",6101]
["MES 30.30.12","Шкаф компактный распределительный","шт",6048]
["MES 30.30.15","Шкаф компактный распределительный","шт",7507]
["MES 30.30.15 RAL7004","Шкаф компактный распределительный","шт",8646]
["MES 30.40.15","Шкаф компактный распределительный","шт",7961]
["MES 30.40.15 RAL7004","Шкаф компактный распределительный","шт",8646]
["MES 40.30.12","Шкаф компактный распределительный","шт",6910]
["MES 40.30.15","Шкаф компактный распределительный","шт",8276]
["MES 40.30.15 RAL3020","Шкаф компактный распределительный","шт",10304]
["MES 40.30.21","Шкаф компактный распределительный","шт",9015]
["MES 40.30.21 RAL3020","Шкаф компактный распределительный","шт",10237]
["MES 40.30.21 RAL7004","Шкаф компактный распределительный","шт",9912]
["MES 40.40.21","Шкаф компактный распределительный","шт",10025]
["MES 40.40.21 RAL3020","Шкаф компактный распределительный","шт",11615]
["MES 40.40.21 RAL7004","Шкаф компактный распределительный","шт",12510]
["MES 40.40.25","Шкаф компактный распределительный","шт",11110]
["MES 40.60.21","Шкаф компактный распределительный","шт",11836]
["MES 40.60.21 RAL3020","Шкаф компактный распределительный","шт",14056]
["MES 40.60.21 RAL7004","Шкаф компактный распределительный","шт",12958]
["MES 50.30.21","Шкаф компактный распределительный","шт",9875]
["MES 50.30.21 RAL3020","Шкаф компактный распределительный","шт",12069]
["MES 50.30.21 RAL7004","Шкаф компактный распределительный","шт",12069]
["MES 50.40.21","Шкаф компактный распределительный","шт",11256]
["MES 50.40.21 RAL3020","Шкаф компактный распределительный","шт",11507]
["MES 50.40.21 RAL7004","Шкаф компактный распределительный","шт",13984]
["MES 50.40.21 RAL7038","Шкаф компактный распределительный","шт",12996]
["MES 50.40.25","Шкаф компактный распределительный","шт",11833]
["MES 50.40.25 RAL3020","Шкаф компактный распределительный","шт",12007]
["MES 50.50.21","Шкаф компактный распределительный","шт",12679]
["MES 50.50.21 RAL3020","Шкаф компактный распределительный","шт",14739]
["MES 50.50.21 RAL7004","Шкаф компактный распределительный","шт",13574]
["MES 50.50.21 RAL7038","Шкаф компактный распределительный","шт",14606]
["MES 50.50.30","Шкаф компактный распределительный","шт",14762]
["MES 60.40.21","Шкаф компактный распределительный","шт",11687]
["MES 60.40.21 RAL3020","Шкаф компактный распределительный","шт",14650]
["MES 60.40.21 RAL7004","Шкаф компактный распределительный","шт",13093]
["MES 60.40.25","Шкаф компактный распределительный","шт",13138]
["MES 60.40.25 RAL7004","Шкаф компактный распределительный","шт",13866]
["MES 60.40.30","Шкаф компактный распределительный","шт",17853]
["MES 60.50.21","Шкаф компактный распределительный","шт",13322]
["MES 60.50.21 RAL7004","Шкаф компактный распределительный","шт",16229]
["MES 60.60.21","Шкаф компактный распределительный","шт",14234]
["MES 60.60.21 RAL3020","Шкаф компактный распределительный","шт",16923]
["MES 60.60.21 RAL7004","Шкаф компактный распределительный","шт",15221]
["MES 60.60.21 RAL9005","Шкаф компактный распределительный","шт",15781]
["MES 60.60.25","Шкаф компактный распределительный","шт",15066]
["MES 60.60.25 RAL3020","Шкаф компактный распределительный","шт",15687]
["MES 60.60.25 RAL7004","Шкаф компактный распределительный","шт",16408]
["MES 60.60.30","Шкаф компактный распределительный","шт",22142]
["MES 60.60.30 RAL3020","Шкаф компактный распределительный","шт",22740]
["MES 60.60.30 RAL7004","Шкаф компактный распределительный","шт",21571]
["MES 60.60.34","Шкаф компактный распределительный","шт",23227]
["MES 70.50.21","Шкаф компактный распределительный","шт",14109]
["MES 70.50.21 RAL3020","Шкаф компактный распределительный","шт",17608]
["MES 70.50.25","Шкаф компактный распределительный","шт",15131]
["MES 70.50.25 RAL3020","Шкаф компактный распределительный","шт",17438]
["MES 70.50.25 RAL9005","Шкаф компактный распределительный","шт",18278]
["MES 70.50.30","Шкаф компактный распределительный","шт",22016]
["MES 80.60.21","Шкаф компактный распределительный","шт",19944]
["MES 80.60.21 RAL3020","Шкаф компактный распределительный","шт",19678]
["MES 80.60.21 RAL7004","Шкаф компактный распределительный","шт",20160]
["MES 80.60.25","Шкаф компактный распределительный","шт",18046]
["MES 80.60.25 RAL3020","Шкаф компактный распределительный","шт",19488]
["MES 80.60.25 RAL7004","Шкаф компактный распределительный","шт",22523]
["MES 80.60.30","Шкаф компактный распределительный","шт",18303]
["MES 80.60.30 RAL3020","Шкаф компактный распределительный","шт",19477]
["MES 80.60.30 RAL7004","Шкаф компактный распределительный","шт",21526]
["MES 80.60.30 RAL9005","Шкаф компактный распределительный","шт",22888]
["MES 80.60.40","Шкаф компактный распределительный","шт",25379]
["MES 80.60.40 RAL7004","Шкаф компактный распределительный","шт",31736]
["MES 80.60.40 RAL7038","Шкаф компактный распределительный","шт",31736]
["MES 80.60.40 RAL9005","Шкаф компактный распределительный","шт",30722]
["MES 80.80.30","Шкаф компактный распределительный","шт",25900]
["MES 80.80.30 RAL3020","Шкаф компактный распределительный","шт",26183]
["MES 80.80.30 RAL7004","Шкаф компактный распределительный","шт",28795]
["MED 100.100.30","Шкаф компактный распределительный двухдверный","шт",55186]
["MED 100.100.30 RAL7004","Шкаф компактный распределительный двухдверный","шт",53379]
["MED 120.100.40","Шкаф компактный распределительный двухдверный","шт",54939]
["MED 120.120.30","Шкаф компактный распределительный двухдверный","шт",62253]
["MED 120.120.30 RAL7004","Шкаф компактный распределительный двухдверный","шт",66147]
["MED 140.100.40","Шкаф компактный распределительный двухдверный","шт",71467]
["MED 140.100.40 RAL7004","Шкаф компактный распределительный двухдверный","шт",71512]
["MED 140.80.40","Шкаф компактный распределительный двухдверный","шт",79106]
["MED 80.100.25","Шкаф компактный распределительный двухдверный","шт",36770]
["MED 80.100.30","Шкаф компактный распределительный двухдверный","шт",33805]
["MED 80.100.30 RAL7004","Шкаф компактный распределительный двухдверный","шт",37070]
["MED 80.100.30 RAL9005","Шкаф компактный распределительный двухдверный","шт",37480]
["MED 80.120.30","Шкаф компактный распределительный двухдверный","шт",44274]
["MED 80.120.30 RAL7024","Шкаф компактный распределительный двухдверный","шт",43207]
["SED 100.100.30","Шкаф компактный распределительный двухдверный из нержавеющей стали","шт",158900]
["SED 120.100.30","Шкаф компактный распределительный двухдверный из нержавеющей стали","шт",202063]
["SES 100.60.30","Шкаф компактный распределительный из нержавеющей стали","шт",105446]
["SES 100.60.40","Шкаф компактный распределительный из нержавеющей стали","шт",125184]
["SES 100.80.30","Шкаф компактный распределительный из нержавеющей стали","шт",125144]
["SES 120.80.30","Шкаф компактный распределительный из нержавеющей стали","шт",136486]
["SES 120.80.40","Шкаф компактный распределительный из нержавеющей стали","шт",179432]
["SES 120.80.40 RAL7035","Шкаф компактный распределительный из нержавеющей стали","шт",187588]
["SES 140.80.30","Шкаф компактный распределительный из нержавеющей стали","шт",184570]
["SES 30.20.15","Шкаф компактный распределительный из нержавеющей стали","шт",20219]
["SES 30.40.15","Шкаф компактный распределительный из нержавеющей стали","шт",26667]
["SES 40.30.15","Шкаф компактный распределительный из нержавеющей стали","шт",36561]
["SES 40.30.21","Шкаф компактный распределительный из нержавеющей стали","шт",38882]
["SES 40.40.21","Шкаф компактный распределительный из нержавеющей стали","шт",36812]
["SES 50.40.21","Шкаф компактный распределительный из нержавеющей стали","шт",39552]
["SES 50.50.21","Шкаф компактный распределительный из нержавеющей стали","шт",59625]
["SES 50.50.30","Шкаф компактный распределительный из нержавеющей стали","шт",60893]
["SES 60.40.21","Шкаф компактный распределительный из нержавеющей стали","шт",42302]
["SES 60.60.21","Шкаф компактный распределительный из нержавеющей стали","шт",66867]
["SES 60.60.25","Шкаф компактный распределительный из нержавеющей стали","шт",71446]
["SES 70.50.25","Шкаф компактный распределительный из нержавеющей стали","шт",73462]
["SES 80.60.21","Шкаф компактный распределительный из нержавеющей стали","шт",79363]
["SES 80.60.30","Шкаф компактный распределительный из нержавеющей стали","шт",93152]
["SES 80.60.40","Шкаф компактный распределительный из нержавеющей стали","шт",92885]
["SES 80.80.30","Шкаф компактный распределительный из нержавеющей стали","шт",123111]
["MEV 100.60.21","Шкаф компактный распределительный с обзорной дверью","шт",25088]
["MEV 100.60.25","Шкаф компактный распределительный с обзорной дверью","шт",27302]
["MEV 100.60.30","Шкаф компактный распределительный с обзорной дверью","шт",28280]
["MEV 100.80.30","Шкаф компактный распределительный с обзорной дверью","шт",31474]
["MEV 120.60.21","Шкаф компактный распределительный с обзорной дверью","шт",30244]
["MEV 120.60.30","Шкаф компактный распределительный с обзорной дверью","шт",32780]
["MEV 120.80.30","Шкаф компактный распределительный с обзорной дверью","шт",37305]
["MEV 120.80.30 RAL9005","Шкаф компактный распределительный с обзорной дверью","шт",43316]
["MEV 30.30.08 M","Шкаф компактный распределительный с обзорной дверью","шт",9294]
["MEV 30.30.12 M","Шкаф компактный распределительный с обзорной дверью","шт",9666]
["MEV 30.30.12 M RAL7024","Шкаф компактный распределительный с обзорной дверью","шт",10494]
["MEV 50.40.21","Шкаф компактный распределительный с обзорной дверью","шт",13601]
["MEV 50.40.25","Шкаф компактный распределительный с обзорной дверью","шт",14177]
["MEV 60.40.21","Шкаф компактный распределительный с обзорной дверью","шт",14487]
["MEV 60.40.25","Шкаф компактный распределительный с обзорной дверью","шт",15570]
["MEV 60.60.25","Шкаф компактный распределительный с обзорной дверью","шт",18230]
["MEV 60.60.25 RAL9005","Шкаф компактный распределительный с обзорной дверью","шт",22450]
["MEV 70.50.21","Шкаф компактный распределительный с обзорной дверью","шт",17371]
["MEV 70.50.25","Шкаф компактный распределительный с обзорной дверью","шт",18099]
["MEV 80.60.21","Шкаф компактный распределительный с обзорной дверью","шт",22989]
["MEV 80.60.25","Шкаф компактный распределительный с обзорной дверью","шт",22033]
["MEV 80.60.30","Шкаф компактный распределительный с обзорной дверью","шт",22224]
["MEV 80.60.40","Шкаф компактный распределительный с обзорной дверью","шт",29579]
["IES 09.60.54","Шкаф компактный телекоммуникационный","шт",41854]
["IES 12.60.54","Шкаф компактный телекоммуникационный","шт",42517]
["IES 21.60.54","Шкаф компактный телекоммуникационный","шт",50288]
["IEV 12.60.55","Шкаф компактный телекоммуникационный 3-х секционный с обзорной дверью","шт",40201]
["IEV 12.60.55 RAL7004","Шкаф компактный телекоммуникационный 3-х секционный с обзорной дверью","шт",47925]
["IEV 16.60.55","Шкаф компактный телекоммуникационный 3-х секционный с обзорной дверью","шт",45639]
["IEV 21.60.55","Шкаф компактный телекоммуникационный 3-х секционный с обзорной дверью","шт",53127]
["IEV 09.60.54","Шкаф компактный телекоммуникационный с обзорной дверью","шт",47790]
["IEV 12.60.54","Шкаф компактный телекоммуникационный с обзорной дверью","шт",49620]
["MKM 160.60.60","Шкаф компьютерный","шт",107336]
["MKM 160.60.80","Шкаф компьютерный","шт",110682]
["MPS 120.60.60","Шкаф распределительный","шт",68907]
["MPS 120.80.40","Шкаф распределительный","шт",71482]
["MPS 120.80.60","Шкаф распределительный","шт",77199]
["MPS 140.60.60","Шкаф распределительный","шт",70862]
["MPS 160.60.40","Шкаф распределительный","шт",63314]
["MPS 160.60.40 RAL7004","Шкаф распределительный","шт",79174]
["MPS 160.60.50","Шкаф распределительный","шт",77034]
["MPS 160.60.60","Шкаф распределительный","шт",66878]
["MPS 160.60.80","Шкаф распределительный","шт",88558]
["MPS 160.80.40","Шкаф распределительный","шт",72388]
["MPS 160.80.50","Шкаф распределительный","шт",80628]
["MPS 160.80.60","Шкаф распределительный","шт",75985]
["MPS 180.40.50","Шкаф распределительный","шт",50202]
["MPS 180.40.60","Шкаф распределительный","шт",51362]
["MPS 180.60.40","Шкаф распределительный","шт",64248]
["MPS 180.60.40 RAL3020","Шкаф распределительный","шт",71747]
["MPS 180.60.50","Шкаф распределительный","шт",65843]
["MPS 180.60.60","Шкаф распределительный","шт",67385]
["MPS 180.80.40","Шкаф распределительный","шт",72334]
["MPS 180.80.40 RAL3020","Шкаф распределительный","шт",80304]
["MPS 180.80.50","Шкаф распределительный","шт",75143]
["MPS 180.80.60","Шкаф распределительный","шт",77060]
["MPS 200.40.50","Шкаф распределительный","шт",54600]
["MPS 200.40.60","Шкаф распределительный","шт",54199]
["MPS 200.40.60 RAL7038","Шкаф распределительный","шт",67775]
["MPS 200.60.40","Шкаф распределительный","шт",65545]
["MPS 200.60.50","Шкаф распределительный","шт",67139]
["MPS 200.60.60","Шкаф распределительный","шт",68681]
["MPS 200.60.60 RAL7038","Шкаф распределительный","шт",84120]
["MPS 200.60.80","Шкаф распределительный","шт",72546]
["MPS 200.60.80 RAL7038","Шкаф распределительный","шт",88872]
["MPS 200.80.40","Шкаф распределительный","шт",73611]
["MPS 200.80.40 RAL7004","Шкаф распределительный","шт",87987]
["MPS 200.80.50","Шкаф распределительный","шт",76350]
["MPS 200.80.50 RAL3020","Шкаф распределительный","шт",94501]
["MPS 200.80.50 RAL7038","Шкаф распределительный","шт",98311]
["MPS 200.80.60","Шкаф распределительный","шт",78267]
["MPS 200.80.60 RAL7004","Шкаф распределительный","шт",95609]
["MPS 200.80.60 RAL7038","Шкаф распределительный","шт",95609]
["MPS 200.80.80","Шкаф распределительный","шт",82024]
["MPS 200.80.80 RAL7038","Шкаф распределительный","шт",101134]
["MPS 220.60.60","Шкаф распределительный","шт",73508]
["MPS 220.60.60 RAL7004","Шкаф распределительный","шт",80102]
["MPS 220.60.80","Шкаф распределительный","шт",84810]
["MPS 220.80.40","Шкаф распределительный","шт",83590]
["MPS 220.80.60","Шкаф распределительный","шт",88437]
["MPS 220.80.60 RAL3020","Шкаф распределительный","шт",109738]
["MPS 220.80.60 RAL7004","Шкаф распределительный","шт",101998]
["MPS 220.80.80","Шкаф распределительный","шт",93483]
["MPD 120.80.50","Шкаф распределительный двухдверный","шт",99063]
["MPD 180.100.40","Шкаф распределительный двухдверный","шт",99748]
["MPD 180.100.40 RAL7004","Шкаф распределительный двухдверный","шт",122863]
["MPD 180.120.40","Шкаф распределительный двухдверный","шт",108544]
["MPD 180.120.40 RAL3020","Шкаф распределительный двухдверный","шт",132381]
["MPD 180.120.50","Шкаф распределительный двухдверный","шт",110365]
["MPD 180.120.60","Шкаф распределительный двухдверный","шт",112225]
["MPD 200.100.40","Шкаф распределительный двухдверный","шт",103098]
["MPD 200.100.50","Шкаф распределительный двухдверный","шт",104096]
["MPD 200.100.60","Шкаф распределительный двухдверный","шт",106578]
["MPD 200.100.60 RAL3020","Шкаф распределительный двухдверный","шт",129753]
["MPD 200.100.80","Шкаф распределительный двухдверный","шт",119966]
["MPD 200.120.40","Шкаф распределительный двухдверный","шт",113820]
["MPD 200.120.50","Шкаф распределительный двухдверный","шт",115605]
["MPD 200.120.60","Шкаф распределительный двухдверный","шт",117464]
["MPD 200.120.60 RAL3020","Шкаф распределительный двухдверный","шт",135872]
["MPD 200.120.80","Шкаф распределительный двухдверный","шт",120557]
["MPD 200.120.80 RAL7004","Шкаф распределительный двухдверный","шт",138898]
["MPD 200.120.80 RAL7038","Шкаф распределительный двухдверный","шт",138898]
["MPD 220.100.60","Шкаф распределительный двухдверный","шт",133918]
["MPD 220.100.80","Шкаф распределительный двухдверный","шт",127243]
["MPD 220.120.60","Шкаф распределительный двухдверный","шт",120541]
["SPD 180.100.40","Шкаф распределительный двухдверный из нержавеющей стали","шт",358491]
["SPD 180.120.40","Шкаф распределительный двухдверный из нержавеющей стали","шт",278052]
["SPD 180.120.50","Шкаф распределительный двухдверный из нержавеющей стали","шт",293390]
["SPD 200.120.60","Шкаф распределительный двухдверный из нержавеющей стали","шт",313423]
["MPD 200.100.60 A","Шкаф распределительный двухдверный усиленный","шт",109725]
["MPD 200.100.80 A","Шкаф распределительный двухдверный усиленный","шт",113648]
["MPD 200.120.60 A","Шкаф распределительный двухдверный усиленный","шт",120610]
["SPS 180.60.40","Шкаф распределительный из нержавеющей стали","шт",269434]
["SPS 180.60.50","Шкаф распределительный из нержавеющей стали","шт",190746]
["SPS 180.60.60","Шкаф распределительный из нержавеющей стали","шт",206023]
["SPS 180.80.40","Шкаф распределительный из нержавеющей стали","шт",209372]
["SPS 180.80.50","Шкаф распределительный из нержавеющей стали","шт",241988]
["SPS 180.80.60","Шкаф распределительный из нержавеющей стали","шт",265823]
["SPS 200.60.60","Шкаф распределительный из нержавеющей стали","шт",212273]
["SPS 200.80.60","Шкаф распределительный из нержавеющей стали","шт",250630]
["SPS 200.80.80","Шкаф распределительный из нержавеющей стали","шт",304028]
["MPV 180.60.50","Шкаф распределительный с обзорной дверью","шт",67282]
["MPV 180.60.60","Шкаф распределительный с обзорной дверью","шт",68813]
["MPV 180.80.50","Шкаф распределительный с обзорной дверью","шт",77787]
["MPV 180.80.60","Шкаф распределительный с обзорной дверью","шт",80542]
["MPV 200.60.60","Шкаф распределительный с обзорной дверью","шт",71606]
["MPV 200.60.60 RAL3020","Шкаф распределительный с обзорной дверью","шт",73718]
["MPV 200.60.60 RAL7004","Шкаф распределительный с обзорной дверью","шт",73461]
["MPV 200.60.80","Шкаф распределительный с обзорной дверью","шт",75495]
["MPV 200.80.60","Шкаф распределительный с обзорной дверью","шт",82808]
["MPV 200.80.60 RAL3020","Шкаф распределительный с обзорной дверью","шт",84325]
["MPV 200.80.60 RAL7004","Шкаф распределительный с обзорной дверью","шт",83978]
["MPV 200.80.80","Шкаф распределительный с обзорной дверью","шт",86565]
["MPV 220.60.60","Шкаф распределительный с обзорной дверью","шт",76538]
["MPV 220.60.80","Шкаф распределительный с обзорной дверью","шт",79046]
["MPV 220.80.60","Шкаф распределительный с обзорной дверью","шт",85569]
["MPV 220.80.80","Шкаф распределительный с обзорной дверью","шт",89793]
["MPS 180.60.40 A","Шкаф распределительный усиленный","шт",73511]
["MPS 180.80.60 A","Шкаф распределительный усиленный","шт",80232]
["MPS 200.60.60 A","Шкаф распределительный усиленный","шт",71853]
["MPS 200.80.40 A","Шкаф распределительный усиленный","шт",76716]
["MPS 200.80.60 A","Шкаф распределительный усиленный","шт",81439]
["MPS 200.80.80 A","Шкаф распределительный усиленный","шт",91459]
["MPD 180.100.60 O","Шкаф распределительный утепленный","шт",242558]
["MPS 160.80.60 O","Шкаф распределительный утепленный","шт",183254]
["MPS 180.60.60 OC","Шкаф распределительный утепленный","шт",154560]
["MPS 180.80.60 OC","Шкаф распределительный утепленный","шт",204616]
["MPP 200.60.100","Шкаф серверный","шт",123939]
["MPP 200.80.100","Шкаф серверный","шт",150864]
["IPP 43.60.100 P","Шкаф серверный IT","шт",179868]
["IPV 43.60.100 P","Шкаф серверный с обзорной дверью","шт",134971]
["IPV 24.60.60","Шкаф телекоммуникационный с обзорной дверью","шт",75914]
["IPV 24.60.80","Шкаф телекоммуникационный с обзорной дверью","шт",83541]
["IPV 24.80.60","Шкаф телекоммуникационный с обзорной дверью","шт",81805]
["IPV 38.60.60","Шкаф телекоммуникационный с обзорной дверью","шт",97563]
["IPV 38.60.80","Шкаф телекоммуникационный с обзорной дверью","шт",107531]
["IPV 38.80.60","Шкаф телекоммуникационный с обзорной дверью","шт",100778]
["IPV 43.60.60","Шкаф телекоммуникационный с обзорной дверью","шт",99467]
["IPV 43.60.80","Шкаф телекоммуникационный с обзорной дверью","шт",109491]
["IPV 43.80.60","Шкаф телекоммуникационный с обзорной дверью","шт",108830]
["IPV 43.80.80","Шкаф телекоммуникационный с обзорной дверью","шт",127389]
["IPV 47.60.60","Шкаф телекоммуникационный с обзорной дверью","шт",92299]
["IPV 47.60.80","Шкаф телекоммуникационный с обзорной дверью","шт",102984]
["IPV 47.80.60","Шкаф телекоммуникационный с обзорной дверью","шт",108662]
["CS 3020.02","Штрих-корректор для подкрашивания RAL3020, 12мл","шт",1300]
["CS 7035.02","Штрих-корректор для подкрашивания RAL7035, 12мл","шт",1300]